##TITLE= Lecture Unknown 5
##JCAMP-DX= 5.00 $$From Command Line Converter 1.0
##DATA TYPE= NMR Spectrum
##DATA CLASS=  XYDATA

##ORIGIN= Exported from Command Line Converter 1.0
##OWNER= SVB
##$URL= http://wwwchem.uwimona.edu.jm:1104/software/jcampdx.html
##SPECTROMETER/DATA SYSTEM= NUTS EXPORT
##.OBSERVE FREQUENCY= 300.149506
##.OBSERVE NUCLEUS= ^1H
##INSTRUMENTAL PARAMETERS= 1H
##XUNITS= PPM
##YUNITS= ARBITRARY UNITS
##XFACTOR= 0.0000032809
##YFACTOR= 11.8187950000
##FIRSTX=   0.499580
##FIRSTY= 19013.000000
##LASTX=   3.780500
##NPOINTS= 8068
##MAXY= 11804684.000000
##MINY= -14111.000000
##DELTAX=   0.000407
##XYDATA= (X++(Y..Y))
152269A608L1q3j5J31J11j01J05j52Q8k5m4m1L3l5R3j9m5J19j08k7Q6l6l9O1m8
155380A648M9l4RN0m4J0pK0K1K8oj7r3P6N2l6L0j6m9K8k1k2m0K5P3n3N1L4n7l9
159098A670M1N5p3P2J04p0J08j09n0K1O5o7J6K6k6LM1J9j06J11j3n7N0o9N5j0
162333A807oN4r2j5N8J3l9ljL2L7kj4K0J4n0q4O6N1m9jP8r0j4P6kj7P4Qm7n4L8
166287A846L6r2Q2l7j3L6L1q1kP8l4l6J24k9q3K8jk8O6q7P5jK3k3j3L7l5K4L7
169882A928l0q4R5J5N0p3J28j6r5j5k8L5L9j6%m8M9J5N1JN2k9n1m6O9n9qJ11r7
173488A943m7M9k1O9o2O3q7K3N6M2l8L7rj7j5ON2%l3J7N1J4L2K0Ml3O9l6r6J59
177207B212Q5J1N3l4j04o1q2J1q7M8roPJ7p4N0M1J2j28J27k8N3k5Q0m0K4l0o1
$$ plain form
152269 1608 1639 1556 1541 1672 1783 1682 1787 1635 1723 1698 1654 1613 1646 1611 1704 1685 1640 1759 1651 1624 1710 1674 1635 1696 1648
155380 1648 1697 1663 1672 1722 1678 1688 1681 1701 1722 1750 1744 1727 1634 1710 1762 1726 1756 1740 1691 1719 1698 1676 1636 1661 1734 1681 1732 1766 1709 1670
159098 1670 1711 1766 1693 1765 1869 1799 1907 1798 1748 1769 1834 1767 1783 1809 1783 1786 1827 1846 1740 1851 1838 1781 1831 1762 1817 1807
162333 1807 1801 1855 1763 1748 1806 1819 1780 1777 1776 1808 1845 1843 1829 1849 1863 1813 1729 1795 1846 1797 1796 1874 1784 1770 1846 1844 1827 1901 1909 1862 1808 1846
166287 1846 1882 1790 1872 1835 1822 1858 1889 1808 1806 1884 1850 1814 1938 1909 1826 1854 1853 1825 1891 1804 1879 1878 1901 1878 1865 1902 1867 1891 1928
169882 1928 1898 1814 1909 1924 1974 1901 2029 2013 1918 1903 1875 1910 1949 1933 1933 1885 1934 1949 2000 2001 2053 2024 1973 1927 1996 1937 1929 2040 1943
173488 1943 1896 1945 1924 1993 1931 1994 1907 1930 1986 2028 1990 2027 2018 2001 1986 1992 2044 2044 2011 2028 2079 2093 2125 2145 2149 2116 2185 2149 2053 2212
177207 2212 2297 2308 2361 2327 2223 2162 2080 2091 2004 2052 2043 2037 2044 2061 1987 2037 2078 2090 1962 2089 2061 2114 2089 2169 2129 2153 2123 2062
180678B062J8O4k2q6J5O5JKJ9n0L5r7J72m8oL7K4L8m6O5k2M2J1M6Mn5Q6K6Q4m2
184396B442J3k8o3j50KRp3L9M6j14M1J00l0l4jRP4N7k7j52M6O6l8O7qlok5OoK6
188238B285p4Q7mnl4L5J5N0q9M4K7k3j2L3j0K2J2%r2N9NN5p7L0pN8o0k7K9LN7
192081B392qk6P1K1L3%r7M4m4L1Q1p1p8j2N7J3K0Kq5oK0o4L3J16l9k6l6K3M2L6
195799B443kL3l0k9L1J3k7k9Q9m7O2p9Q3p1R2N0Rk8k9N5m5j3K7l7R5p0Mj62J34
199394B522q3Q8j25J18k0R9j8l9j2J8J23K5P8l2L0KJ03M4rO0p3J1r6J5m3J0m1
202741B755P5Pj0q3P5nk4N6n5j0RL8K6M3n0nO9m7N5k6N2KNn6N3m2R3n5Nm2Q9K0
206707C017N3r4R2q4J52j9L6O6o4JQ0o6O9m2J28qP0m5N5l0P4J08Q2M0J78J30K88
$$ plain form
180678 2062 2080 2144 2122 2036 2051 2116 2117 2119 2138 2088 2123 2026 2198 2150 2144 2181 2205 2243 2197 2262 2240 2282 2293 2339 2343 2288 2374 2400 2484 2442
184396 2442 2455 2427 2364 2214 2216 2225 2152 2191 2237 2123 2164 2264 2234 2200 2199 2208 2282 2339 2312 2160 2206 2272 2234 2301 2293 2290 2284 2259 2265 2259 2285
188238 2285 2211 2298 2294 2289 2255 2290 2305 2355 2266 2310 2337 2314 2302 2335 2325 2347 2359 2359 2267 2326 2331 2386 2309 2339 2332 2390 2330 2303 2332 2335 2392
192081 2392 2384 2358 2429 2450 2483 2483 2386 2430 2386 2417 2498 2427 2349 2337 2394 2407 2427 2429 2344 2338 2358 2294 2327 2443 2404 2378 2342 2365 2407 2443
195799 2443 2441 2474 2444 2415 2446 2459 2432 2403 2492 2445 2507 2428 2511 2440 2532 2582 2591 2563 2534 2589 2544 2531 2558 2521 2616 2546 2550 2388 2522
199394 2522 2439 2527 2402 2520 2500 2599 2581 2542 2530 2548 2671 2696 2774 2742 2772 2774 2877 2921 2912 2972 2899 2910 2814 2829 2786 2796 2755
202741 2755 2830 2837 2827 2744 2819 2814 2790 2846 2791 2781 2790 2828 2854 2897 2847 2842 2911 2864 2919 2893 2945 2947 2952 2896 2949 2907 3000 2945 2950 2908 2997 3017
206707 3017 3070 2976 3068 2984 3136 3117 3153 3219 3155 3156 3236 3170 3239 3197 3325 3317 3387 3342 3397 3367 3441 3549 3631 3671 3849 3979 4267
210054D267K29M39O53Q77O25l8j014j198r83m74j34Q1q0n4J2nNN5J7m1O0j35O7
212898C231j7q5J41o0m3J6K47J20Mn8J7j9R8q1K5O8n3NJ1JJ4j4K5KL7n5M4J07
216369C728K53J64J28K90L13M95P33Q25O91l06j062j365p61n16l7J1q4n3L1J7
218842C495M5oO9j9j4k9Q0m7Q8m5k2M7k7J21J01o6J17j15k9j6%J4nm1m4MQ7Q3
222312C826j2m6p9j05k09K8Q6K14K3K9M8QN9PO5N0O1QJ14K96J69K74M0J68K06
225423E328J23L9J96M40Q70Q30n96j574j219o81m0Q3RR1J32m3Q7j6O2j0pq1P3
228256D096O6L2Qk2N7K8j3K6N0j57N7l7J7P8Q6NM2m1MJ20j5P5l8o7J31J25L01
231603E014L10K07J66J87P5J50J56J22N36J054P04r17j789j181n24n3J48O3PJ62
$$ plain form
210054 4267 4496 4935 5588 6465 7090 7052 6038 4840 3857 3383 3249 3330 3250 3196 3208 3203 3208 3263 3280 3239 3299 3164 3231
212898 3231 3214 3129 3270 3210 3167 3183 3430 3550 3554 3496 3513 3494 3592 3511 3536 3604 3551 3556 3567 3568 3582 3568 3593 3595 3632 3577 3621 3728
216369 3728 3981 4145 4273 4563 4876 5371 6104 6929 7620 7314 6252 4887 4126 3610 3573 3584 3500 3447 3478 3495
218842 3495 3540 3534 3603 3584 3570 3541 3621 3574 3662 3617 3595 3642 3615 3736 3837 3771 3888 3773 3744 3728 3728 3742 3737 3696 3652 3656 3743 3826
222312 3826 3814 3768 3689 3584 3375 3403 3489 3703 3726 3755 3803 3811 3870 3877 3942 3992 4053 4061 4175 4471 4640 4914 4954 5122 5328
225423 5328 5451 5490 5686 6126 6996 7826 7230 5656 4437 3756 3716 3799 3808 3899 4031 3988 4075 4059 4121 4111 4104 4023 4096
228256 4096 4162 4194 4202 4180 4237 4265 4252 4278 4328 4171 4228 4191 4208 4286 4372 4377 4419 4378 4382 4502 4487 4562 4524 4457 4588 4713 5014
231603 5014 5324 5531 5697 5884 5959 6109 6265 6387 6923 7977 8681 7764 5975 4794 4270 4217 4365 4428 4435 4597
234106D597p3J46Q0M4j5M6j09jk9J60QN6J01j20K8L0QJ00j27K14K3R7j0o3L4J8
237310E243L4M0q7Nj0N7P5p8K2k8J8m2J6N6j6LJ18q9j9P1n0M6j15R2M4J77p7R2
240781E598l6P1p9l2K5QlK6RRM1J04J34OK3lK1L4k8J07K9K8l8M9j2o1kRO1L0J01
244623F229J86Mmj12J3kO8r6J23k0M6k1M5M5M0J8J18l9k0J03J6m6K4m5m6J43P7
247970F847J71J24l6N9J30J49L08L64M36M21K68L68J03K30L19R5Q2J84K74L05
250443A1201j67o54q10m32l03N0j96P7R6Q4k00k8k9J04k6k2O4KM5Q7l5J07J04
253306I119jL3L0Lj5j86O0J77K42lj8L1O2l5J55Q1J01K22L02M87M07M04K46K37
256293A2141K51K26J98K94J80K31L90K50q0q56o53m65j71j41j85j13N6K2J21m5
$$ plain form
234106 4597 4524 4670 4750 4794 4779 4825 4716 4715 4686 4846 4854 4910 5011 4891 4919 4949 4957 5057 4930 5144 5167 5264 5254 5191 5225 5243
237310 5243 5277 5317 5230 5235 5225 5282 5357 5279 5301 5273 5291 5249 5265 5321 5305 5308 5426 5337 5318 5389 5339 5385 5270 5362 5406 5583 5506 5598
240781 5598 5562 5633 5554 5522 5547 5555 5552 5578 5587 5596 5637 5741 5875 5881 5904 5901 5922 5956 5928 6035 6064 6092 6054 6103 6091 6030 6028 6037 6098 6128 6229
244623 6229 6415 6419 6415 6303 6316 6314 6382 6286 6409 6389 6435 6414 6459 6504 6544 6562 6680 6641 6621 6724 6740 6694 6718 6673 6627 6770 6847
247970 6847 7018 7142 7106 7165 7295 7444 7752 8116 8552 8973 9241 9609 9712 9942 10261 10356 10438 10622 10896 11201
250443 11201 11034 10380 9570 9138 8835 8885 8689 8766 8862 8946 8746 8718 8689 8793 8767 8745 8809 8811 8856 8943 8908 9015 9119
253306 9119 9118 9151 9181 9184 9169 8983 9043 9220 9462 9459 9441 9472 9534 9499 9654 9735 9836 10058 10360 10847 11254 11658 11904 12141
256293 12141 12392 12618 12816 13110 13290 13521 13911 14161 14081 13225 12572 12107 11936 11795 11610 11497 11553 11575 11696 11651
258766A1651Q9q6J71M6k4O9J61j03R4L3Q0R8O4j24ll17l0qk4J5N08L76M75o4k6
261877A3121l8L04j67J90l9K78P5J31K3J51n7K11mK91QJ66K3M46K62K91l54k79
264585A5033j13J35M3K69J09J60M6L09L04K61MJ38M5K27K05K61J1L71J14L16K44
267182A8492J94M3L05P42P46Q68j8r49J5M35R84n1P7L15L96K46K74L19O37K97
269673B4367N39J88R07Q10J020Q31J046Q87J320J295J677J244J052J180K216K667
271663D3246L994K743J39q17P75K653K874Q6J415L600O228Q553J2335J5152J7475
273516A20451J8368K0661K3658L0053M1196N9032R0879J58945K53547J36655k87784
274885F65661l69470j70129o1641k0058j0206m062k013R76J119J929J666J808
$$ plain form
258766 11651 11740 11654 11825 11871 11847 11916 12077 11974 12068 12101 12181 12279 12343 12219 12216 11899 11869 11861 11837 11852 12360 12736 13211 13147 13121
261877 13121 13083 13387 13220 13410 13371 13649 13724 13855 13878 14029 13972 14183 14179 14470 14478 14644 14667 15113 15375 15666 15312 15033
264585 15033 14920 15055 15098 15367 15476 15636 15682 15991 16295 16556 16560 16698 16743 16970 17175 17436 17447 17818 17932 18248 18492
267182 18492 18686 18729 19034 19776 20522 21390 21372 20423 20438 20873 21857 21806 21883 22198 22594 22840 23114 23433 24070 24367
269673 24367 24906 25094 26001 26811 27831 28662 29708 30595 31915 33210 34887 36131 37183 38363 40579 43246
271663 43246 47240 49983 50122 49305 50080 52733 55607 55693 57108 60708 66936 75489 87824 102976 120451
273516 120451 138819 159480 183138 213191 254387 313419 404298 563243 816790 953445 665661
274885 665661 296191 126062 64421 44363 34157 30095 28082 29058 30177 32106 33772 35580
276379C5580J073Q85p96j131Q1J523J803J819O06j951j765m58N93J219J974K044
278338D3099L088L917K570q46n17N80L134J976L89J351M348O039R781J2514J6803
280221A08226J7623K0245K1124K6054L1343M6960O2611J03607J80884K98542Q1587
281560I98806l80719l52656j50737n3697k0525q808m976j055M57J739J423J804
283054C1056N69J342j88j720k288o2K44Q35M99j122m157k816j924q68p34m19n28
285155A7719K04O4K35l11l6l15R7n3J49m73j67n13p1k18j12l79l0r0j71k17L76
287782A5688m92M83N80J238j71j164o32j19K3J21k7L93K1M55P6J7l56k18k98k21
290255A5397l18%j31j8l60j73l60k52m44l20m83m30q87k72K7L07k9j57j98r9k72
$$ plain form
276379 35580 36653 37538 36742 35611 35692 37215 39018 40837 41443 39492 37727 37269 37862 39081 41055 43099
278338 43099 46187 50104 52674 51828 51311 51891 55025 57001 57390 58741 63089 69128 78909 91423 108226
280221 108226 125849 146094 167218 193272 224615 271575 334186 437793 618677 917219 998806
281560 998806 618087 265431 114694 60997 40472 31664 26688 25633 26090 27829 29252 31056
283054 31056 31625 32967 32779 31059 28771 28709 28953 29788 30287 29165 25008 22192 20268 19400 18666 18247 17719
285155 17719 17923 17987 18222 17911 17875 17560 17657 17604 17753 17280 17113 16600 16529 16311 16199 15820 15790 15700 15529 15312 15688
287782 15688 15196 15679 16259 17497 17326 16162 15530 15411 15434 15555 15528 15921 15942 16397 16473 16490 16134 15916 15618 15397
290255 15397 15079 15079 14948 14930 14570 14397 14037 13785 13341 13021 12538 12108 11221 10949 10976 11283 11254 11097 10899 10800 10528
292840A0528m8k64j01k09k70j47m7k14j56r7j4k06j0j9N7k83j9K67N15n99o53
295467H011n71L4k79j05j91O6j37Qn5j13j35j9j45L7k46KQ2J78J68J86l5ml7%
298424F700l4r0k44oj93l26j04J70j19J1r0ok53K8j78o7q0N4j52J8M5J01k89J09
301411E005J41K62K23N08J96o86j018l54l32p6n7M0R5k2j50P5J1J22j64R1m9o3
304119C798O2J78Q5M13K27K10N4J17m6M7k44k04Lk19k44k6J0J54L8n0M4k7j21
306982D259J47j11J23q9J11j73J60j3m4j24K6k63l4R9P5q8K6j28KL9m2mj6j08
309969C830m8q0rn4M4l4P5n4N5j06K8m8K01j4K3j9J01j5m7k01q0o7m2m3L8l5n3
313298C346J9q5L1L1N2L0o4K3q8M6j59p5J6J02No7q9J3j11N9k8J9j20L9m6r8j47
$$ plain form
292840 10528 10480 10216 10115 9906 9636 9489 9442 9228 9072 8975 8961 8755 8745 8726 8783 8500 8481 8748 9263 8664 8011
295467 8011 7440 7474 7195 7090 6899 6965 6828 6836 6781 6668 6533 6514 6369 6406 6160 6162 6244 6422 6590 6776 6741 6737 6700 6700
298424 6700 6666 6576 6332 6326 6133 5807 5703 5873 5754 5765 5675 5669 5416 5444 5266 5199 5119 5173 5021 5039 5084 5185 4896 5005
301411 5005 5146 5408 5631 6139 6335 5649 4631 4277 3945 3869 3812 3852 3947 3925 3775 3850 3861 3983 3819 3910 3861 3798
304119 3798 3860 4038 4123 4536 4763 4973 5027 5144 5098 5145 4901 4697 4700 4481 4237 4211 4221 4375 4413 4363 4407 4380 4259
306982 4259 4406 4295 4418 4329 4440 4267 4427 4414 4370 4246 4272 4009 3975 4074 4149 4061 4087 3959 3961 4000 3958 3954 3938 3830
309969 3830 3782 3702 3693 3639 3683 3649 3724 3670 3725 3619 3647 3599 3800 3786 3809 3790 3891 3876 3829 3628 3548 3481 3439 3396 3434 3399 3346
313298 3346 3365 3280 3311 3342 3394 3424 3360 3383 3295 3341 3182 3107 3123 3225 3230 3163 3074 3087 2976 3035 3007 3026 2906 2945 2899 2801 2654
316644B654J34j65Q2m4M6oM2r5K6j54j5K5L9Lj03L1J05p4r0J07ko8qj02J28r6
319879B400Lj6Pj03L4q5M1j9O9n6J36K%J7J25j4J58J81K79M16P35L17M67J98q88
322990D404o81q60o19l67k02K6j07N1k4M9l2J01rJ13OO0K5J35K02O27l20p97j69
325823A612m3j25nJ3L4p2J46k04O6l6nm4R4j41J02j6O6m0J44j63J36PK11J9K86
328934B042m7L56N5L71K71O13J24Q89J118K258q92P49m32m833r75n04R5j06O4
331270A216j72J91p4J19L7Q5K78K64M10Q5q78l07j76J37MR0j09j29j70J9j53M2
334022H09O4Q9o0O5jM0K3K1j45J05j1k7N7kR1J25J09R7O6J80K16K88K72L68O15
337102C454Q45J054J450J034k56p89k069j351j096r03k57j76P6O6q1m3J12o9J
$$ plain form
316644 2654 2788 2623 2705 2661 2707 2701 2743 2648 2674 2520 2505 2530 2569 2572 2469 2500 2605 2531 2441 2548 2546 2478 2470 2368 2496 2400
319879 2400 2403 2387 2394 2291 2325 2240 2281 2262 2331 2275 2411 2413 2413 2430 2555 2541 2699 2880 3159 3575 4310 4627 5094 5292 4404
322990 4404 3723 2863 2244 1877 1675 1701 1594 1645 1621 1670 1638 1739 1730 1843 1849 1909 1934 2069 2271 2898 2578 1781 1612
325823 1612 1569 1444 1439 1452 1486 1414 1560 1356 1422 1386 1381 1337 1431 1290 1392 1376 1442 1402 1546 1383 1519 1526 1737 1756 2042
328934 2042 1995 2351 2406 2777 3048 3661 3785 4674 5792 8050 7158 7907 7475 2642 1667 1163 1258 1152 1216
331270 1216 1044 1235 1161 1280 1317 1402 1680 1944 2354 2439 1561 1254 1078 1215 1219 1309 1200 1071 901 920 767 809
334022 809 873 962 902 967 966 1006 1029 1050 905 1010 999 972 1029 1027 1118 1243 1352 1449 1515 1695 1911 2199 2471 2839 3454
337102 3454 4299 5353 6803 7837 7581 6792 4723 3372 2276 1373 1116 940 1016 1082 1001 958 1070 1001 1002
339469A002M4J9m9L4J11r0k87m9j36L1J1j2L4j4P5J19j06j9J8J7k7l9Q7MJ9Q4
342674H81n4M8J71N5J35R0K59J61J96L98O43Q19Q19J56o68j287j015o69l88j54
345177E96P2j02J01j03J23Mj25N6J09j43mk4k1K6K6j01O6o2l5J1K0j2o0M9M3j46
348400C64o0MJ19j10Q3k0p0qJ3NO6Lp9j5k9r1P2m8M5Olk6J9K3j2l3j4l7J11l9
352118B39k5M4J0j26R3p1P4n9l2P4j9q3m6O3k5pN7P7j14l4j5qk0M0k6l3rj2J19
355695A26M7j05Pn6k4J3M6ml3j47N5k9lm6J5L3oLK2k8O5j7k9k8l7J32o7j6j3M
359413a20oo3M7K5q6L8N8k4n9L3m7R5m6R3o5M3j08O1q7ol6K4J11K6m0m0j05m0
362884c24J20lp8J35p8j1n6K6k9N0j05Q5m1J2M2l1m2J02j41K1%M2j4j0O6q7j3
$$ plain form
339469 1002 1046 1065 1016 1050 1161 1071 784 735 599 630 641 629 663 649 724 843 737 718 736 753 726 687 774 778 797 881
342674 881 827 875 1046 1101 1236 1326 1585 1746 1942 2340 2983 3802 4621 4777 4109 2822 1807 1138 750 596
345177 596 668 566 667 564 687 691 566 622 731 588 584 560 539 565 591 490 556 494 459 470 490 478 418 467 510 364
348400 364 304 308 427 317 400 380 310 302 315 320 386 389 310 295 266 175 247 199 244 250 247 221 240 263 251 218 204 167 278 239
352118 239 214 258 268 142 235 164 238 179 147 221 202 119 73 136 111 104 161 238 124 90 75 67 47 87 61 28 19 7 126
355695 126 173 68 75 19 -5 8 54 50 17 -130 -75 -104 -107 -153 -138 -105 -111 -108 -86 -114 -49 -66 -95 -123 -160 -28 -95 -111 -124 -120
359413 -120 -126 -189 -142 -117 -203 -165 -107 -131 -190 -157 -204 -109 -155 -62 -127 -84 -192 -131 -218 -224 -260 -236 -125 -99 -139 -179 -284 -324
362884 -324 -204 -207 -285 -150 -228 -239 -295 -269 -298 -248 -353 -268 -309 -297 -255 -286 -328 -226 -367 -346 -346 -304 -318 -328 -262 -349 -362
366230c62K7J0j8J5n3N5l8n6L2L2r3O6P3lL6o7k2n3N7r4JOJ29o9k1j9k6M5l2j4
369949d56Q1jq0P2Jj06P3K8p0k8K6J6l3M6k8L1k0n2M8MJ0o6RLN1m2Q3o5j08Q8
373667d85j2J3N5q5O4k7J8L4j31J39q4M8p0Pk6Q1Pn2M4oRO1l4k8L1m2m9m2Q9j5
377386d88q1M0J4k4N3j04k4P4P5Nk4l5j1m2R1n9J51j57K2O8j06J5n8J2M7J6K5
380745e05L8j3r2L9l5P9p2JM7J1K7km4J4l4J8k5Kk6Q7n9p0N3n0L1R3j10J02m7
384339e42l0Qm2M0o7Q0rM1q2Om5R8JJ5J4p4P3m0nj9L4o2LL4j4J13n2r0j5o6Q9
388182f05N5%n6J8Rm7K9J8j1km7P2L3n1j5J9n2L6J4k5L5n2n4L9j0KL3K4L8om5
392024f04k8mK4k7m7J70j08j1R0N%j7n2m2P0j1L1mk7M8r0K9lM4j3k0mk4N2n0M0
$$ plain form
366230 -362 -335 -325 -343 -328 -381 -326 -364 -420 -388 -356 -449 -383 -310 -313 -277 -344 -366 -419 -362 -456 -455 -449 -320 -389 -410 -429 -455 -410 -442 -456
369949 -456 -375 -376 -456 -384 -383 -489 -416 -388 -458 -486 -460 -444 -477 -431 -459 -428 -448 -500 -452 -448 -438 -504 -495 -492 -441 -483 -400 -465 -573 -485
373667 -485 -497 -484 -429 -514 -450 -477 -459 -425 -556 -417 -501 -453 -523 -516 -542 -461 -454 -506 -462 -468 -459 -398 -432 -460 -429 -471 -520 -562 -473 -488
377386 -488 -569 -529 -515 -539 -486 -590 -614 -540 -465 -460 -484 -519 -530 -572 -481 -540 -389 -546 -524 -456 -562 -547 -605 -593 -546 -530 -505
380745 -505 -467 -480 -572 -533 -568 -489 -561 -560 -513 -502 -475 -477 -521 -507 -541 -523 -548 -546 -572 -485 -544 -614 -561 -611 -580 -487 -597 -495 -542
384339 -542 -572 -564 -606 -566 -633 -553 -562 -521 -603 -597 -642 -544 -543 -528 -514 -588 -515 -555 -560 -579 -545 -607 -604 -570 -584 -471 -523 -613 -628 -694 -605
388182 -605 -550 -550 -606 -588 -579 -626 -597 -579 -590 -592 -639 -567 -534 -585 -600 -581 -633 -597 -583 -608 -573 -625 -679 -640 -650 -648 -615 -591 -553 -559 -604
392024 -604 -632 -636 -612 -639 -686 -516 -624 -635 -545 -540 -540 -557 -609 -651 -581 -592 -561 -565 -592 -544 -634 -605 -608 -564 -577 -597 -601 -625 -573 -623 -583
395866e83j9N1j06J4j17m9k3oK4L1N2O2k9M3K1o6JO8Rn5N2N3M8r7q6N9K9l9N0
399461f08J2j1l5N1J1Ro0NQ4q5MR3k4K5K2l5J06j24j8l0M7j6L9Qp4N9pr9J4nj93
403303h35l7n4PL2J16L1m9P6M2m2k5pL1K8MN2l6O9n3k8n5R5m0J7J0Lk8J7P1l8
407022f26N8J3%n4p1J15K5j08OO4N3n4j4pJ1j4j0j9l8J7M3j8l1O1k8j6J2nm6M6
410740f35q3R0l7R1n9l1L4N0m3QJ6jO4r0L0q0N3K0n6M8N7o0M2k4L0m9o7j4J24
414335e72L0k6k9N5K2O7K2r1lJ3l6N5j9k5J3N2r0J5j7j9J7l2O8p2Q5l4k0o5O0
417930e76m8M1o6P9K4m4K4k3L8mn2M4l0NJ2j2O7q1lK5j9J4n8R5o2K3J1l3n8R4
421648e73QJ22p0RL7m6J29l1p3K3QORM8N%j24R5j1J1o9PM7k0k8Q2j20j5n1L8j1
$$ plain form
395866 -583 -602 -551 -657 -643 -760 -809 -832 -838 -814 -783 -731 -669 -698 -655 -634 -700 -699 -631 -622 -677 -625 -572 -524 -621 -707 -648 -619 -658 -608
399461 -608 -596 -607 -642 -591 -580 -571 -631 -626 -542 -627 -623 -530 -554 -529 -507 -542 -436 -560 -578 -608 -561 -577 -538 -530 -604 -545 -552 -651 -637 -642 -835
403303 -835 -872 -926 -919 -887 -771 -740 -789 -713 -671 -713 -738 -745 -714 -686 -682 -630 -666 -597 -650 -678 -733 -638 -678 -661 -651 -648 -676 -659 -588 -626
407022 -626 -568 -555 -555 -609 -680 -565 -540 -648 -642 -578 -525 -579 -593 -600 -589 -603 -613 -632 -670 -653 -610 -628 -659 -598 -626 -642 -630 -635 -681 -635
410740 -635 -718 -628 -665 -574 -633 -664 -630 -580 -623 -615 -599 -600 -536 -626 -596 -676 -623 -603 -659 -611 -554 -614 -572 -596 -566 -615 -682 -696 -572
414335 -572 -542 -568 -597 -542 -520 -453 -431 -522 -525 -512 -548 -493 -512 -537 -524 -472 -562 -547 -564 -583 -566 -598 -530 -602 -517 -551 -571 -636 -576
417930 -576 -624 -583 -649 -570 -546 -590 -566 -589 -551 -555 -607 -563 -593 -588 -576 -588 -521 -602 -605 -580 -599 -585 -643 -548 -610 -587 -576 -609 -667 -573
421648 -573 -565 -443 -513 -504 -467 -513 -384 -415 -488 -465 -457 -451 -442 -394 -389 -389 -513 -418 -429 -418 -487 -480 -433 -453 -481 -399 -519 -534 -585 -547 -558
425490e58O4R3j62P9q2K9N4J4k0n6j4n9N5l8M6q5OQ6L8j07O7K9p1Q8k3P8m4p9
428961e72M2q1J53P0j07Rm0O2J3m7J3J%K2L3k2J06m4PM0j6Pj20nK2j2q6J04p4
432556e22J6k9K4M4n4L3M4kk6p7O5lM8m3K5np4N3qL1k4p3L7J1j6J8j6M1MJ2r7
436398e63N7K8m5l0n1K5R3q7J69q0K5p3J00J7J2o9O6Qm5n5Q7n0l2k1jK3L2l4k3
439993e17N1p1R9N3q8Kr7N6l4O2l7O9pJ9o6O0o5K3K7r8Q4J2j0M3p5J3O4m4o2P8
443711d56J0l1MK2L8m6J9J4o4P2k4K5j3m6O7ko8J4P4m9N4%m7j1j2K4j8jl0Qm2
447553e15J20o8N1l0P4N6j00n6O5j1qK6J9l6K4m9o6O4O5n0k1J9L5rP0m6l4L4j12
451148d89K2J0K2K1N4l7K4r6R2n4K2m4Q0q3K0N2L7n0J9m1M1k7J0O6o8m0J60l4
$$ plain form
425490 -558 -494 -401 -563 -484 -566 -537 -483 -469 -489 -545 -559 -618 -563 -601 -555 -640 -634 -548 -510 -617 -550 -521 -592 -504 -527 -449 -493 -572
428961 -572 -530 -611 -458 -388 -495 -486 -526 -464 -451 -498 -485 -484 -484 -462 -429 -451 -345 -389 -382 -342 -358 -351 -471 -476 -454 -466 -552 -448 -522
432556 -522 -506 -535 -511 -467 -521 -488 -444 -446 -472 -549 -484 -487 -439 -482 -457 -462 -536 -483 -491 -460 -484 -557 -520 -509 -525 -507 -523 -482 -478 -466 -563
436398 -563 -506 -478 -523 -553 -604 -579 -486 -573 -404 -484 -459 -532 -432 -415 -403 -472 -406 -398 -443 -498 -411 -461 -493 -514 -515 -492 -460 -494 -517
439993 -517 -466 -537 -438 -385 -473 -471 -568 -512 -546 -484 -521 -452 -459 -440 -506 -446 -511 -488 -461 -559 -475 -463 -473 -430 -505 -492 -428 -472 -534 -456
443711 -456 -446 -477 -473 -451 -413 -459 -440 -426 -490 -418 -442 -417 -430 -476 -409 -411 -479 -465 -391 -440 -386 -386 -433 -444 -456 -432 -450 -451 -481 -473 -515
447553 -515 -395 -463 -412 -442 -368 -312 -412 -468 -403 -414 -422 -396 -377 -413 -389 -438 -504 -440 -375 -425 -446 -427 -392 -401 -331 -377 -411 -377 -489
451148 -489 -467 -457 -435 -414 -360 -397 -373 -469 -377 -431 -409 -453 -373 -456 -436 -384 -347 -397 -378 -419 -378 -405 -395 -329 -397 -437 -277 -311
454631c11p2J4k1n5O3K2N8mJ3k8K5O3r5j1R7q8QKJ02l8M2j1L0J17o3J3j23k1m0
458225c12M3l4k8K1n9Q2j27%J47j02L5m9J6R0j09J15j7k3P8no0n0K1K1L5j28P3
461572c26J07O9r8p6o9L9J15n3Q3q6j8O4L9L7q4K36r0J4J3J6K6Q4mo4k9rj00J4
465024a50q0jn6N2L5ll7Q0l0o2q7J01O1k8l7kK0k1pl5j3R1k1PM4Oq5j03o9J82
468743b48J75m7k0k1j1Q7n7J1J1K3O3k4K2J37j15O6K6P0M2k1m4l6mo6M6o6m0p4
472213a15N3qM7Q1j18O1n3m5P0r6Q8p7l1L6K8o6o3N9o2k6J1rj6L4K05J29k87j56
475684c26J52Q7R4o6j33J13j35R3L4j0Po2J10K9O2O0qQ2j02m6Q9j8n5m2j4n2l1
479043h8R7oo9P2N3K7o5N0q5P3j1L7j01O9p3l9K5m4m0N8q4J72L02l81l37Q5K50
$$ plain form
454631 -311 -383 -369 -390 -445 -382 -360 -302 -306 -293 -321 -296 -233 -328 -339 -242 -330 -322 -320 -218 -256 -214 -225 -195 -78 -141 -128 -251 -272 -312
458225 -312 -269 -303 -331 -310 -369 -287 -414 -414 -267 -369 -334 -383 -367 -277 -386 -271 -288 -311 -233 -238 -298 -348 -327 -306 -271 -399 -326
461572 -326 -219 -150 -248 -324 -393 -354 -239 -292 -209 -295 -313 -249 -210 -173 -257 -21 -111 -97 -84 -68 -42 42 38 -26 -55 -64 -164 -150
465024 -150 -230 -231 -287 -235 -200 -203 -240 -160 -190 -252 -339 -238 -177 -205 -242 -244 -224 -245 -252 -287 -300 -209 -230 -223 -179 -173 -258 -361 -430 -248
468743 -248 -73 -120 -140 -161 -172 -85 -142 -131 -120 -97 -34 -58 -36 101 -14 52 78 148 190 169 125 89 85 19 65 -1 -41 -115
472213 -115 -62 -70 -23 58 -60 1 -52 -97 -27 -123 -35 -112 -143 -107 -79 -145 -208 -149 -211 -237 -226 -235 -251 -217 -12 117 -170 -326
475684 -326 -174 -87 7 -59 -192 -79 -214 -121 -87 -97 -90 -152 -42 -13 49 109 101 183 81 35 124 106 51 9 -5 -57 -88
479043 -88 9 3 -66 6 59 86 21 71 -14 59 48 85 -16 53 -20 -59 -34 -78 -118 -60 -144 28 330 -51 -388 -303 -53
482389e3J96n29J14J73j32nP5K4m8O0N0j5r9J55J6j8O2N2K1l2l8r9J07ol2j81
485624a82R2J66j10P2n5K2N9qoj0%Q9K5J2K5p2r1qj61J05k4j51M4R1l20p98J42
488971a052R58P39K4m34P1n0q8P7l9l8J41p0r2O2m8K3J9j05J1J14o0l9M6L9j0
492051A99p2M3J9m3L2j2j4L6q1N5L0J2k0jjO6P5j43N6j19o2M4p2l5oQ2m72n98
495534a002K58J028Q55m86m47J54Q8r6j07J10nj8m9l1O8l6j2j0J66K1j7j8j49
498397B65J25o7J6qJ2n6M5oJ6J06l4kl0N4L3m6O2O9K9K14q9l5j62j55PmJl6l3
501992B91L01j94j28P1KJ50l18o3K49l5j2J06LJ5J0P3P8prj7J56j09L8n2J8J43
505196G60j15rJ0j9l6j2O4K2n5L5OJ6o1J41LJ14N3K8J10J92Q1J84K30R8K15n4
$$ plain form
482389 -53 143 -386 -272 -99 -231 -236 -161 -137 -185 -125 -75 -90 -189 -34 -18 -36 26 78 99 67 29 -70 37 31 -1 -182
485624 -182 -90 76 -34 38 -17 5 64 56 50 40 40 129 154 166 191 119 28 20 -141 -36 -60 -211 -167 -76 -396 -1194 -1052
488971 -1052 -94 645 669 235 306 256 168 245 206 168 309 239 147 209 161 184 203 98 109 223 163 124 170 209 199
492051 199 127 170 189 146 178 166 152 188 107 162 192 204 184 183 182 248 323 180 236 117 55 99 27 -8 -14 68 -404 -1002
495534 -1002 -744 284 1139 653 206 360 448 352 245 355 350 332 283 252 320 284 272 262 428 449 432 414 265
498397 265 390 323 339 331 343 287 332 326 342 448 414 412 382 436 469 423 485 554 583 797 708 673 511 356 363 359 360 324 291
501992 291 592 398 270 341 343 493 175 112 361 326 314 420 423 438 448 521 599 592 583 566 722 613 651 599 617 760
505196 760 645 636 646 627 591 579 643 665 610 645 651 667 606 747 750 864 917 945 1055 1247 1328 1512 1742 1840 2055 2001
508419B001j04k35m9K28L02k34o17k75j43m9J46o6m7P4JM5J4J5R8r6J8rPR7J17
511530A239oj2p9L1L4l5K5j1l2J14m6J4J12p0O2J6J06N4P7J10J14R4J46L06K48
514610B611L15M93N27O41Q00J260J575K056J233k145k793j529r38o53m62m45l08
516742B238j73j10k2K7n4n9N1pN6L4O2K8m8J69q3O8p4qlJ3O3P2J3R3RJ58K1J55
520212B689L2K80J08N2L47K68N14M58N79Q24Q93J135J292K129K688M402O071N182
522437B9943m450o924k889k339k233k074j830j267o47n50l29k56j93nj75p0j41
524551C571j21J5o0n0lQ5n9K4p4J03j1J14K1K55J01o0J65Q8K95J73L10J01L02
527383E285L71N63Q06P68J199J217J498J899K509L240M683P376J0202Q213m330
$$ plain form
508419 2001 1897 1662 1613 1841 2143 1909 1292 1017 874 825 971 905 858 932 933 978 992 1007 1105 1009 1027 1018 1025 1122 1239
511530 1239 1233 1221 1142 1173 1207 1172 1197 1186 1154 1268 1222 1236 1348 1278 1340 1356 1462 1516 1593 1703 1817 1911 2057 2363 2611
514610 2611 2926 3419 3946 4587 5387 6647 8222 10278 11511 9366 6573 5044 4106 3453 2991 2546 2238
516742 2238 2065 1955 1933 1960 1906 1847 1898 1891 1947 1981 2043 2071 2023 2192 2109 2177 2103 2095 2092 2105 2168 2240 2253 2346 2355 2513 2534 2689
520212 2689 2721 3001 3109 3161 3508 3776 4290 4748 5327 6151 7044 8179 9471 11600 14288 18690 24761 29943
522437 29943 25493 18569 15680 13341 11108 9034 7204 5937 5290 4740 4411 4155 3962 3957 3782 3712 3571
524551 3571 3450 3465 3405 3355 3352 3437 3378 3402 3328 3431 3420 3534 3555 3810 3911 3851 4016 4104 4399 4572 4882 4983 5285
527383 5285 5656 6219 7025 7793 8992 10209 11707 13606 16115 19355 24038 31414 41616 49829 45499
529236D5499q103o883o845m974l820k503j615j169j355p75m20l80l57m34l72l11
531226E183k78l3j68m6j15k5M9l5n8J36r5Q3N2J95N2J96M5J25K03K57K25K05M26
534089F579K61N31P64R22J324J370J611K022K738L413M972P403J1000R180K023
535942E6113l993j1240r407o108n722m393k879j864j307q87p07m26k28j17l29
537807F506k74l71k55j56j78j93j26j37j04Kpr1O7R2J08r7J60P9R3qK59K8K68
540640E665J28K90L24N11O84P99R83J148J389J932K093L248M581P140P712N839
542647D4466j7q038o629o411n916m077k432j699j287r85n84m25k43j75j52k62
544637E134k19j49k48j15r7j44j27mj05j41Lo0nL1nQ7j3J2K2M1j27J33Q2J34J70
$$ plain form
529236 45499 37396 30513 23668 18694 14874 12371 10756 9587 8232 7457 7037 6657 6300 5866 5494 5183
531226 5183 4905 4872 4704 4658 4543 4518 4567 4532 4474 4610 4515 4598 4650 4845 4897 5093 5138 5263 5466 5723 5948 6153 6579
534089 6579 6840 7371 8135 9057 10381 11751 13362 15384 18122 21535 26507 33910 44910 54090 56113
535942 56113 52120 40880 31473 25365 19643 15250 12371 10507 9200 8313 7606 7180 6952 6835 6506
537807 6506 6232 5861 5606 5450 5272 5079 4953 4816 4712 4714 4707 4616 4683 4775 4883 4786 4946 5025 5118 5110 5369 5397 5665
540640 5665 5793 6083 6407 6918 7602 8401 9384 10532 11921 13853 15946 19194 23775 30915 38627 44466
542647 44466 44449 36411 29782 23371 17455 13378 10946 9247 7960 6975 6391 5966 5723 5548 5396 5134
544637 5134 4915 4766 4518 4403 4306 4162 4035 4031 3926 3785 3788 3728 3723 3754 3749 3836 3823 3835 3857 3898 3771 3904 3986 4120 4290
547735D290J57J73L52M42N55N86O56R13J258J649K505M020M666M16p77k979n089
549818A3793l529k192j317j082p94n65l76l61j2j25q1k8j23j27o3J5j26kj73k9
552309B703j48m0o5L7L9j00j8J1j3k5k6J1oN6N2p0K0r3J13P6J18J43J92J40J08
555420C215K78L26N74P03J011J728L75j403j203j067r72n88l81k57k38m6q5l2
557645A938n0l9M4p8n0j26M4pj20N8Rl1P2k5p6n7Q0m8j12Q1k06R2k9LQO4p3m4
561116A322j0j5M9J3O6m2J5l1k3P5O1K7JJ33K50J31j14m06j13j75L9j41q1Q1l9
564196A073k6pl2j5qL8q7K0L3K2p8K0rJ1K6k0o5J7O7j04n3P5K0K0l3k8M9j07J03
567791I22k7o8l3n4R0l1k3k6j0n0P7K4r3o2Q2l1l9L7p9N3l1o7P1J26k6L2N2k0
$$ plain form
547735 4290 4447 4620 4972 5414 5969 6555 7211 8124 9382 11031 13536 17556 22222 22638 21861 18882 13793
549818 13793 10264 8072 6755 5673 4879 4314 3938 3577 3565 3440 3359 3331 3208 3081 3018 3033 2907 2905 2732 2703
552309 2703 2555 2515 2450 2487 2526 2426 2408 2419 2406 2381 2355 2366 2360 2416 2468 2398 2418 2325 2438 2514 2632 2775 2967 3107 3215
555420 3215 3493 3819 4393 5096 6107 7835 8210 6807 5604 4537 3565 2977 2596 2339 2101 2055 1970 1938
557645 1938 1888 1849 1893 1815 1765 1639 1683 1676 1556 1614 1623 1592 1664 1639 1563 1506 1586 1538 1426 1507 1301 1393 1364 1367 1375 1439 1366 1322
561116 1322 1312 1297 1346 1359 1425 1383 1398 1367 1344 1419 1480 1507 1508 1641 1891 2022 1908 1502 1389 1214 1253 1112 1031 1112 1073
564196 1073 1047 1040 1008 993 985 1023 936 956 989 1011 933 953 944 955 981 961 896 913 980 876 823 898 918 938 905 877 926 819 922
567791 922 895 827 794 740 830 799 776 750 740 690 767 791 698 636 718 687 648 685 606 659 628 561 632 758 732 764 816 796
571274G96J6L8o5l9n4J5p6j0RN2o2m0N6N7Kn7L3m9pk3Q9p9J7p5j4O8j7j6j0O5
574992F20K2m4m9l1M5l4l2n1L0L6%j9jJ10j15o3Q1K9rj5L6m8Jj3M6n6p6K6KJ7
578711D45P2J9j2J1Rn9j01J24o2m8M9k0%K3k9N2k7O1m3n3Q8p0p7N3L3j54J00O
582181C90j3N6j8J7o5O6P5n3j10P0L8j36J04oMl1j0l1l0K2n8K3N0n4O7k0O2l3
585652C76m7JQ2q5mK7j42N4M9o6Q1M7l9l2K2p6nM5m7L7L6j25O6k6n5P3j7j1n9
589259A60L9K9r0L3l4K9Oj1J6P6l7K0N5n4o0J19q3K3K5J2q6J68j05N4R0q3J63
592605D74o4K1k5j37J0p5n9NP0O2k3q7O3m6k7Q4n0n1qj0M5%m0L4M0r0MO1j9l9
596324A23P1OK7n5J1k8J1nL7j22M6Q8p9l0L3L1p%L7J8Q6L2l2lJ30R4l7k24m6k0
$$ plain form
571274 796 812 850 785 746 692 707 631 621 630 682 620 580 636 693 695 638 671 622 615 592 681 602 619 544 530 598 581 565 555 620
574992 620 642 598 549 518 563 529 497 446 476 512 512 493 492 602 487 424 505 534 525 510 546 498 499 486 532 476 400 426 428 445
578711 445 517 536 524 535 544 485 384 508 446 398 447 427 427 450 421 473 446 507 464 411 499 429 352 405 438 284 384 390
582181 390 377 433 415 432 367 433 508 455 345 415 453 317 421 415 419 388 378 347 317 339 281 304 354 300 367 347 409 376
585652 376 329 330 412 327 323 350 208 262 311 245 326 373 334 302 324 248 243 288 241 278 314 189 255 229 174 247 230 219 160
589259 160 199 228 138 171 137 166 172 161 177 253 216 236 291 237 177 296 213 236 261 273 187 355 250 304 394 311 474
592605 474 410 431 406 269 279 204 145 150 220 282 259 172 235 189 162 246 196 145 137 127 172 172 132 166 206 116 120 181 162 123
596324 123 194 200 227 172 183 155 166 161 198 76 122 210 131 101 134 165 158 158 195 213 299 331 299 296 426 520 483 259 213 193
600042A93q7mJ08q9%j8J21j08O4j2m3J0p4NPN5m1M0on8l1J3L5o5LM8j3K3L0n0
603761E6j16J31k4K9M0j31Q5K8M0QP0M6j07LL8L8J7K8k5J30k0j33j35p5l6O8k5
607089B8K6J4n5L1J00o1k3j8l3L8kk6oqj8J7k2O0k7N6M9p7M1r5P6L6n8L0p3J0
610808A0J4l7j1JM4j2R5n0QJ4P0l6Lk0o7M9P3J8j05j9%k9k2L9N2mm0m8JK8o5k7
614792g3K6J2J7L6rJ5M4l4rjJJO0j5o8N5J1P9o5%K6Kp3K3n2Onk0K4q9N2O0k1n3
619006c7l1rO1n4O5N4j04R7r4J00p2oK4k0q5L8Q8o0P5r0lM0l4M1K1o7J10j03M8
622601gLq6M9J1O0k2k8J04j21Q3n4M3Jp4l7M3j02J8L5L2k2p9J36l4k0J9q1P2n2
626196a10N9L0j8l7Q6j28P8j2J5n8M4q8K3P5j3m1m4O5qL5J6L6o6Lkp5J9J4Mj5
$$ plain form
600042 193 106 102 210 121 121 103 224 116 180 168 125 135 61 66 73 128 87 127 121 63 32 45 80 15 18 66 53 76 106 56
603761 56 -60 71 47 76 116 -15 70 98 138 146 216 262 155 158 196 234 251 279 254 384 364 231 96 21 -15 53 28
607089 28 54 68 13 44 144 83 60 42 9 47 45 19 13 5 -13 4 -18 42 15 71 120 43 84 -11 65 101 43 73 0 10
610808 10 24 -13 -24 -23 21 9 104 54 62 76 146 110 113 93 26 75 148 166 61 42 42 13 -9 30 82 78 38 -10 -9 19 -46 -73
614792 -73 -47 -35 -18 18 9 24 68 34 25 24 25 26 86 71 3 58 69 148 83 83 109 111 38 61 9 15 10 -10 14 -75 -23 37 16 -37
619006 -37 -68 -77 -16 -70 -5 49 -55 42 -52 48 -24 -30 -6 -26 -111 -73 15 -45 30 -60 -63 -23 -57 -16 5 -62 48 -55 -7
622601 -7 -4 -90 -41 -30 30 8 -20 84 -37 46 -8 35 36 -38 -75 -32 -134 -116 -81 -49 -71 -150 -14 -48 -68 -49 -130 -58 -110
626196 -110 -51 -21 -39 -76 10 -118 -40 -52 -37 -95 -51 -139 -116 -41 -54 -95 -139 -74 -82 -47 -31 5 -61 -58 -60 -135 -116 -102 -98 -113
629914a13L%O1kkl2K4K4k9J52j24O1n2p7J3L4k8N4j24J23m2J5l9Jpn6O6O5l1l7
633633i9n4J8J1RL4L3p2M1mK0J0n4M1m6k6O7n7J7m5O8l5L7j14J46Ln4L5n6M4j3
637351i5L9k0N2q8K3l5N0r3P6j1LL2Kn6O3l4M3q5nm7K7M9j6o4Q2mN1m5K7PK9k1
641317f4M3q3P9l0L4J7r1j3J1l8j3L6KK7J2r5Q0M1j14M6R1j23N4k8j6j9P4m0J24
644912Dj09k0Oj4L2J6p1N9n0R3j01M5J1m8L9N5k1J0j27J38n9mL1n3L1J8N3j17
648383a53QK4N3j6M8n4K5J1J6l6Pm6k5NJ18j68J38r1L6%l8O2p1K4m9n7J14m6m0
651977b01O9K5PL0o0K6J6Oj06l%M9k1J5l0J24r1p7J05J2Ml2K9l7k4kP9o6RP6J08
655820C9j73O1j6k2P1o1l2N6l8O8Jl2k2k1nj4j65M7J6nMK8J00n6M6j4j0m6M6Q6
$$ plain form
629914 -113 -110 -110 -49 -51 -53 -85 -61 -37 -66 86 -38 23 -29 -106 -93 -59 -87 -33 -157 -34 -76 -61 -100 -99 -106 -162 -96 -31 -62 -99
633633 -99 -153 -135 -124 -115 -81 -48 -120 -79 -83 -63 -53 -107 -66 -112 -138 -71 -128 -111 -156 -88 -123 -86 -200 -54 -51 -105 -70 -126 -82 -95
637351 -95 -56 -76 -24 -112 -89 -124 -74 -167 -91 -102 -99 -67 -65 -121 -58 -92 -49 -134 -139 -186 -159 -110 -126 -190 -108 -112 -61 -106 -79 -72 -43 -64
641317 -64 -21 -104 -25 -55 -21 -4 -95 -108 -97 -135 -148 -112 -110 -83 -71 -166 -86 -45 -159 -113 -22 -145 -91 -119 -135 -154 -80 -120 4
644912 4 -105 -125 -119 -133 -101 -85 -156 -97 -147 -54 -155 -110 -99 -147 -108 -53 -74 -64 -191 -53 -112 -116 -85 -138 -107 -89 -36 -153
648383 -153 -145 -121 -68 -84 -36 -90 -65 -54 -38 -74 -67 -113 -138 -133 -15 -183 -45 -136 -100 -100 -138 -76 -147 -123 -172 -229 -115 -161 -201
651977 -201 -132 -107 -100 -70 -130 -104 -88 -82 -188 -191 -191 -142 -163 -148 -178 -54 -145 -222 -117 -105 -101 -133 -104 -141 -165 -167 -88 -154 -145 -69 39
655820 39 -134 -73 -89 -111 -40 -101 -133 -77 -115 -47 -46 -78 -100 -121 -126 -140 -305 -258 -242 -247 -243 -215 -115 -171 -125 -139 -149 -195 -149 -63
659538f3j35P6k1O2j9Np7K0n3J58p0KL3K1j05R9p6k7M8O4p9NM8Rl5L4p7O5k4N1
663256f1O1P6J8K83L01n97o5r2l8lOk1P9l5j5l8L8O4p3pj3M5K1k0P1q4l9J3J2
666851a13nQ6p1N7l9j1l2N2l5RMM4l9k3Q3n4p6N8qo3%J20p4L3L4K9l7JL1l2n7
670693a28P7m4M3p7Q5l5qJ2K4j5N6K2o0n9K4M4k3K7O4j31k6J1MQ2o2N9k8j07O7
674288a02m9L4l1N2n0J2M1M2m1k2O9o9N1k0k3L5p7O8q3R6O2j21MK7l3P1l5l0K
677883a20LjN8Lk5jr5J01k9N4l5l1N3qq3P2j4lK3k9k2l4J15l4K2m9lmJ4Q2o5o6
681849a51R1pQ7k9q6K8m1K4J6K6r3K6QJ4KM9OJ0n1P3j08M0JJ3m5j0L7N0nk9J3
685691d1jM6k0m2J9n2N8K7K5k4n6R9n3J1l5PL4L1p1J15k6n2K1RJ0j85M9O0j2K7
$$ plain form
659538 -63 -198 -122 -143 -81 -100 -95 -172 -152 -205 -47 -117 -115 -82 -61 -166 -67 -143 -170 -122 -58 -137 -132 -84 -75 -110 -76 -153 -88 -112 -61
663256 -61 0 76 94 377 678 81 16 -76 -114 -117 -111 -132 -53 -88 -103 -141 -103 -39 -112 -119 -132 -87 -66 -86 -15 -99 -138 -125 -113
666851 -113 -118 -32 -103 -46 -85 -96 -128 -76 -111 -102 -98 -54 -93 -116 -33 -87 -163 -105 -113 -176 -176 -56 -130 -97 -63 -34 -71 -70 -39 -71 -128
670693 -128 -51 -95 -52 -129 -44 -79 -87 -75 -51 -66 -10 12 -48 -107 -83 -39 -62 -35 29 -102 -128 -117 -113 -31 -93 -34 -62 -169 -102
674288 -102 -151 -117 -148 -96 -146 -134 -93 -51 -92 -114 -45 -114 -63 -83 -106 -71 -148 -80 -163 -67 -5 -126 -122 -95 -128 -57 -92 -122 -120
677883 -120 -117 -118 -60 -57 -82 -83 -178 -77 -106 -52 -87 -118 -65 -73 -156 -84 -98 -101 -78 -107 -129 -163 -48 -82 -60 -109 -112 -116 -102 -20 -85 -151
681849 -151 -60 -67 20 -9 -95 -67 -108 -84 -68 -42 -135 -109 -101 -87 -85 -36 -30 -20 -71 2 -106 -66 -65 -52 -97 -107 -70 -20 -25 -54 -41
685691 -41 -42 4 -16 -58 -39 -91 -33 -6 19 -5 -61 38 -15 -4 -39 -32 2 33 -38 77 51 -1 20 29 39 -146 -97 -37 -49 -22
689410b2o1P1K2n1n5J45j10M0k5kn2lJ6K9M2KM5p8J6l1m2%J5O2op1O0Lj0l8O9
693252b0M7q1L7l2L8n9K5K4kj8K3m0lJ6n8L6J36l3n4k4o2P6O3j1kl2j73R8N6j
696971c0OK5p1Q0l2K2Nj3K8Mn0m0rQ3l8n5O1K5j08M9K4oNkj1OR3ooj3l1L0OL0
701173F1n9Q1M0j19k3M5jpOO9L0J44J40J37k6n6q6K02N64P87Q66o8k09j042q37
704284F39k41k11oj6J1M3o3j3N8o2JJ3J2qj5k8n4j9Q6k8K9q2J01J7n4k5O3K0N3
707878B21l5L3l5O1q5J7J1K4L2k2j04J54L4K50j5m9o0J46R0M98J30O04O16K636
710865E152P44j599j05k093r83n26mk43P3j22P4j76J68j14J23p7%n1J07q7l4L0
713574B57m6rP8o4kn1Q4j07N8k3P7j11j3MR3JJ5Lm3oMN9k1l4K0J0J14M4Q4K5n7
$$ plain form
689410 -22 -83 -12 10 -41 -96 49 -61 -21 -46 -48 -100 -103 -87 -58 -16 -14 31 -47 -31 -62 -104 -104 -89 -27 -33 -104 -44 -41 -51 -89 -20
693252 -20 27 -54 -17 -49 -11 -70 -45 -21 -23 -41 -18 -58 -61 -45 -103 -67 69 36 -18 -42 -104 -28 35 24 22 -10 -183 -85 -29 -30
696971 -30 -24 1 -70 10 -22 0 5 -8 20 24 -26 -66 -75 8 -30 -85 -24 1 -107 -58 -34 -40 -35 -37 -48 -42 51 45 39 26 -5 25 31 61
701173 61 2 83 123 4 -19 26 25 18 24 93 123 267 407 544 518 462 376 578 1142 1929 2795 2727 2518 1476 639
704284 639 398 187 181 165 176 219 156 143 201 139 140 153 165 157 142 114 60 41 127 99 128 46 147 164 110 85 148 168 221
707878 221 186 219 184 245 160 177 188 212 244 222 118 272 306 556 541 492 432 578 668 1166 1296 1900 2516 5152
710865 5152 5896 4297 4192 2099 1116 590 586 343 416 294 368 192 360 246 369 292 292 241 348 261 227 257
713574 257 211 202 280 216 214 163 247 140 198 175 252 141 128 132 225 226 241 244 201 195 199 258 237 203 223 233 347 391 475 500 443
717416D43J55J49K32N10R96N9o9m97j062k47k08p1j14J07j25M2J7k0l7J0j10O6
720168B26M7K5j26R3k1k5P0p8p2L3nJ7o4OL1K0k4Pjn9Q8rM2n9K5m6L0N8n6M7q6
723998A34mJ19m6N2M8q5n6J4j4nq6L6M0J5m8Q2q2Lp6O5n2N4n1o7Q0om2R7l3J0
727716I6n5J0M9j6K2O1j32J6L0k1L2J5m0J14n4K5n4J6l0n4M6n6J00o5O1j4K0o9
731199E3qM8K7K7J8n4N8k2o2LJ8l7p4R2pJ8K9p0l2N4L3j04P8jL3M1j3mj6O6m5
735042A47R7o5pO2J02J2J05P8K0J03K22K40j17K5k7k47j52k15r5Lo1J5j93o2m
738140a4m7p2R3J18R8J30Q0L9l3O7p7K1l2o5j4L5o4On4K2Q2j14j0J20q8O3m9r
741593B32K9k6j0o0J40q7M9J0o1P1j11J21o7O7n6M3p6J0m9Pn7JN5jK4pQ3r0K0
$$ plain form
717416 443 598 747 979 1489 2485 2544 2475 1978 916 669 461 390 276 383 258 300 317 297 260 270 160 226
720168 226 273 298 172 265 244 219 289 211 139 172 167 184 120 126 157 177 153 160 159 100 188 179 221 162 187 141 171 229 173 220 134
723998 134 130 249 203 255 303 218 162 176 162 157 71 107 147 162 114 196 114 117 41 106 54 108 57 -10 70 64 22 119 86 96
727716 96 41 51 100 84 106 167 35 51 81 60 92 107 67 181 127 152 98 114 84 30 76 20 120 55 116 102 122 53
731199 53 45 93 120 147 165 111 169 147 85 88 106 69 -5 87 80 98 127 57 25 79 112 8 86 85 118 159 146 142 126 192 147
735042 147 244 179 172 234 336 348 453 531 551 654 876 1116 999 1024 997 750 598 383 288 291 230 245 52 -10 -14
738140 -14 -61 -133 -40 78 176 306 386 425 392 459 382 403 371 306 292 327 263 269 215 237 319 205 195 315 227 290 241 232
741593 232 261 235 225 165 305 218 267 277 216 287 176 297 230 297 241 284 208 218 169 176 119 120 175 174 198 191 274 184 204
745187B04l0jM3j0Lk7M7mR8j20K9P0j4QRp6O4OK1l8J3n7lK6M9l0rom7Q9J3lOj23
749420B00O8q8O9J10j60O9K4j17L8M2o1L3M2lK8m5K2KP4l4o2j3l3N8K0k7Rq8o
753014A71m0J27M5n5j0j1j9k2K6J0J9o4j1R0j08N9O6m6J8N3n1m6j2R1On3Q7k2
756467B98J0KrQ2j26LM5K5l2k1o3PJ4k8Nl6k6K6J37J06r1O0L3N6N4P0O7J40l5
760061G73J55K04m7J02j20J00J17J13J31O2k4k01j05l7r4j62j7j10K3J99q8M3
762800A017Kq3J11j44J15j20o5M4j31J27j0j3J9J2J15m0O4j3r3mm2P4j88P0K9
765881H53r6L9J3k3K4M8p8OMO2j31J9k2L7l7k1N1J1oK9m1m2k9j5L9j04J68J67
769382I25LK4K3m0p4R0r6J8L9rL3j4r8oL6Nr2j16q3K4J24J11K4J31qL0l8J18m
$$ plain form
745187 204 174 173 216 206 209 182 229 225 323 203 232 302 288 296 305 229 293 299 320 282 295 238 235 261 310 280 271 265 218 307 320 317 323 200
749420 200 268 180 249 359 199 268 292 175 213 255 194 227 269 266 294 249 271 273 347 313 251 238 205 263 283 256 265 177 171
753014 171 131 258 303 248 238 227 208 186 212 222 241 177 166 256 148 207 273 227 245 298 247 201 189 280 286 233 320 298
756467 298 308 310 301 383 257 260 305 330 298 277 214 221 235 207 212 176 150 176 313 419 328 388 421 477 531 601 668 808 773
760061 773 928 1132 1085 1187 1067 1167 1284 1397 1528 1590 1566 1365 1260 1223 1129 967 950 840 863 1062 974 1017
762800 1017 1019 936 1047 903 1018 898 833 877 746 873 863 850 869 881 996 956 1020 1007 914 910 868 942 754 824 853
765881 853 757 796 809 786 810 858 780 786 790 852 721 740 718 755 718 697 748 759 753 782 741 699 670 655 694 590 758 925
769382 925 928 952 975 935 861 951 855 873 912 903 936 922 824 818 854 859 767 651 568 592 716 827 851 982 974 1004 966 1084 1080
772958A080n8J3N7L4N6j7l5K5m2J07jl8M8kk6M2q6r1J12j15J45j31J40j8kN6j03
776305A150J93q5J13j6M9m6Q6q6L2M5R9lJ21P0J50J66K5J50L6p6o6j14L2N2pJ13
779540B183j10k6Ll8J48M5R3J11J87M2K73J45J54K42J99J92L66K30K53L16L54
782124E362J63M01L41M60M14O53O14P26R20J123J437J769K464L045M099N126O510
784256C5627Q460J0838J4650K0395K7616L2092K8093J6843L743r866k3285l3267
785719A31939l4093k6394j7804j1415p669n007l428k543j828j571j224j024r54
787336A6985j050p63q29m84n99o39m19l66l40m26j23l61l01k99j92k86j60j86
789561I162j59p9k16n3j27j47j42j61o9q8m7j67j34j3p9k6M1J36K0K3K9Nj12p5
$$ plain form
772958 1080 1022 1035 1092 1126 1182 1165 1130 1155 1113 1220 1219 1181 1229 1227 1201 1243 1157 1066 1178 1063 1208 1077 1217 1199 1197 1253 1150
776305 1150 1343 1258 1371 1355 1404 1358 1444 1358 1390 1435 1534 1531 1652 1722 1872 2038 2063 2213 2249 2173 2107 1993 2025 2077 2070 2183
779540 2183 2073 2047 2050 2012 2160 2205 2298 2409 2596 2638 2911 3056 3210 3452 3651 3843 4209 4439 4692 5008 5362
782124 5362 5525 5926 6267 6727 7141 7794 8408 9134 10054 11177 12614 14383 16847 19892 23991 29117 35627
784256 35627 44087 54925 69575 89970 117586 149678 177771 194614 198357 188491 165206 131939
785719 131939 97846 71452 53648 42233 34564 29557 26129 23586 21758 20187 18963 17939 16985
787336 16985 15935 15172 14343 13859 13260 12621 12202 11836 11496 11070 10947 10586 10285 9986 9794 9508 9348 9162
789561 9162 9003 8924 8708 8655 8528 8381 8239 8078 8009 7921 7874 7707 7573 7560 7481 7455 7496 7632 7652 7675 7704 7709 7597 7522
792548G522o2j31L0k1j03p6J9j12k04L6q5k06N3j30j46q4q5j13j5j74nj52k18
795411E538o4j72m0r3k5K4l6K5j35m6m9N7j42l1r8qo8j01lj46J1j17J7j07j13
798492D078l7j01j32j8q9O7M8j0J5P0j35k0L9M0q7l3j85J6j04P5o1o8P7j91L7
801603C291J3r4q6P7pj06l0k4n0r8ml8M6m8p2m0loj27k44J80l7J02m4j09M3n3
804931B432J5j1M4PQ4p3J18o9k15k3%k58O1j02J80j29j77N8J11j3Q5j10j4L7k5
808030B013N4K0L6K3P4J0K6P4q7K0qp5j03j35j0N7N2M5M4J0l0M3n5RK5k7o1o1
811513A983KM3q2m9K8j28r7J1Q4n6MP8Q5j6l3Q9j24j37M5K36K52n8k43Ko2p7N0
814859A830l4J2J6k2Q2L6Mj9r1M7Nj00k7O0o7N0q0roqJ6K4o5K1n3oO7no3J1R8
$$ plain form
792548 7522 7460 7329 7359 7338 7235 7159 7178 7066 6862 6898 6813 6607 6660 6530 6384 6300 6215 6102 6087 5913 5908 5756 5538
795411 5538 5474 5302 5262 5169 5144 5168 5132 5157 5022 4976 4927 4984 4842 4811 4713 4705 4637 4536 4533 4387 4398 4281 4298 4191 4078
798492 4078 4041 3940 3808 3790 3701 3768 3816 3806 3821 3891 3756 3736 3775 3815 3728 3695 3510 3526 3422 3497 3436 3368 3445 3254 3291
801603 3291 3304 3210 3124 3201 3194 3088 3058 3034 2984 2886 2882 2844 2890 2842 2770 2730 2727 2721 2594 2350 2530 2493 2595 2551 2442 2485 2432
804931 2432 2447 2436 2480 2487 2571 2498 2616 2547 2332 2309 2309 2051 2112 2010 2190 2061 1884 1942 2053 2040 2125 2015 2001 2038 2013
808030 2013 2067 2087 2123 2146 2220 2230 2256 2330 2243 2263 2255 2180 2077 1942 1932 1989 2041 2086 2130 2140 2110 2153 2098 2107 2132 2105 2044 1983
811513 1983 1985 2028 1946 1897 1925 1797 1700 1711 1795 1739 1743 1821 1906 1890 1857 1946 1822 1685 1730 1966 2218 2160 1917 1919 1857 1780 1830
814859 1830 1796 1808 1824 1802 1884 1920 1924 1905 1814 1861 1866 1766 1739 1799 1732 1782 1702 1693 1687 1679 1695 1719 1654 1675 1622 1616 1683 1678 1615 1626 1724
818702A724K3p7J13j09O2Kp5L7o0l9j21J04j1k34N9M80j0n2j62k33K4K8J22n5
821689A540J3J5r1jJ24qm3j4n2Pp0L1P6l7o3M2q3K8k5K8P1j05k9P9J8q8Jj0J2
825283A366l0Nk9o3k5k6rK4P6j13M7K4l8M6k8m8J52k2m8j66n8J96O1n9j18K8N0
828612A195m9k6j3J7j7O%l9J8k9jJ9o0M9q2R3o0KrQl0Q8m2l4l5QO2j9l0J21m4
832454A067k2L6J3n4jJ0J0m0l5J14j52m5J5p3R2K3q2MM4j7ql2M3N3j40O5M9Mr7
836049H44Pj2l1J8j8P7oK9n7k9qL7p0J7M2j3L0n4K3L8l8p5ONK0n5k5j2kJ00r4
839891F94K8j0n2n2J20M0q0K2M3L4K6j23P8p1l1J36j0j9j6n9R9l5J08q0K3J4j5
843238H12RK0o1n2L5l2J7LJ4j9j26N2m1j4Kj3j7O5k4L0k6M6L1k5L9%o7k0K7mJ0
$$ plain form
818702 1724 1747 1670 1783 1674 1736 1738 1663 1700 1640 1601 1480 1584 1573 1339 1398 1878 1868 1816 1654 1421 1445 1473 1595 1540
821689 1540 1553 1568 1477 1476 1600 1592 1549 1535 1483 1490 1420 1451 1527 1490 1427 1469 1386 1414 1389 1417 1488 1383 1354 1433 1451 1363 1364 1354 1366
825283 1366 1336 1341 1312 1249 1224 1198 1189 1213 1289 1176 1223 1247 1209 1255 1227 1179 1331 1309 1261 1095 1037 1233 1294 1235 1117 1145 1195
828612 1195 1146 1120 1107 1124 1107 1113 1113 1074 1092 1063 1062 1081 1021 1070 988 1081 1021 1023 1014 1022 992 1080 1038 1004 969 977 1039 1020 990 1111 1067
832454 1067 1045 1081 1094 1040 1039 1049 1059 1019 984 1098 946 901 916 843 935 958 876 880 924 907 899 867 910 963 823 888 937 941 844
836049 844 851 839 808 826 808 885 879 908 851 822 814 851 781 798 840 827 857 803 826 864 826 751 757 762 782 727 702 690 688 788 694
839891 694 722 712 660 608 728 768 688 710 753 787 813 690 768 697 666 802 792 773 757 698 797 762 870 790 813 827 812
843238 812 821 841 780 728 763 731 748 751 765 746 620 672 631 617 619 606 589 654 630 660 634 680 711 686 725 725 658 638 665 661 671
847080F71L3l6nl6L1J3J8o1M0o7M7m6O5O2p0j0j1KJ5M0K1N3l0o2M5j8k4n2K0j2
850799F36o6J3M1lj3rO0j33J41Njn9l8m7O6n8K4oK7j02J22Op9L9J5nL9pj7m4M8
854641E95P8j33M8k7jj0L2n7M2J8o0O5l9K7M4m6%N7n0K9p4MOj7O7n5k8O7k1l1
858359E30j3k3JnK0K6o2mM2P5Jp2O3m4K6o4kLl8k7K0J39r0j6lp9K4N5L8n6j7M7
862344D95jK8r0l2L3n0J38j19M2OJ7j3qM3p4R0Mj03j9J6L2Jp1M6n2N5Q9q0K7k0
866063D30O8J6r0J13j3k8p9JOP8n8N5m6m3j2J4PK5o7K7k9Jk5M3j0R2j17O1p2M
869781C52j9qJ3P1j33J62j47R1J3Mp3L2N1j8l9k7lj7J26r2P0o1J1l4L1L3k9m2
873233C18l0Q5q6O2n7ON4l2j1R2r4l4N5JNm7P4k3qp6J12K2o1Jk1N3m9qm7Q7jn7
$$ plain form
847080 671 704 668 663 627 658 671 689 628 668 601 648 602 667 729 659 649 638 640 655 695 716 769 739 677 722 704 680 628 648 636
850799 636 570 583 624 621 608 599 659 526 667 672 671 612 574 527 593 535 559 553 580 478 600 606 527 566 581 576 615 608 591 547 595
854641 595 673 540 588 561 560 550 582 525 567 585 525 590 551 578 622 576 576 633 583 612 538 542 548 531 598 543 515 582 561 530
858359 530 517 494 495 490 510 536 474 470 512 587 588 516 579 535 561 497 495 498 460 433 453 592 502 486 483 404 428 483 521 465 448 495
862344 495 494 522 432 400 433 383 521 402 444 450 467 454 446 489 415 505 509 406 387 403 435 436 365 411 359 414 503 423 450 430
866063 430 498 514 424 537 524 496 417 418 424 502 444 499 453 410 398 412 419 444 377 404 375 376 351 394 384 476 359 420 348 352
869781 352 333 325 338 409 276 438 291 382 395 399 326 358 409 391 352 325 322 305 431 339 409 348 359 325 356 389 360 318
873233 318 288 373 287 349 292 298 352 320 309 401 307 273 328 329 334 287 361 338 330 254 366 388 327 328 307 360 311 303 256 343 342 285
877218B85J2po7R0k1K7r5K9MO1p8J1L8P3j00J10r3K6Q3j3p2l7j5JL8L7o1P0o7
880825B69P2Lp5R8q0m9R1j8m1L9jn9J5n0J14o3J1K4J0Rk1q0P9o4QJ1m6m9k5J42
884543B74nk6n5Q5j2%N5k7r7rJ11n2pj1N6l6n9R3r6L7R0r1J06r8Q7p9j8J1Oq4
888262A49N5R4q0Lk4P4o3K9o0J0k6M8RJ7p1R9K6m5k8k9k4L5o1M9j04K3J11j21
891732I5Q0RP9m9m7P5N2j03J5K1N9m4m9M7J11j55J2J8LL8l0M2l1n8jN8m9M5j22
895327A21R9l5OM7p4qJ1pN9j1J2L4J4m5n3P3m6J8q7Q5q2L1J43j04%q4P8M8r6K6
899045A73n5P1L8K5J4q1K4j5K5M3r1J02l2q3rR0p5R5j0j06M8l3J7o3qO5j0K0K2
902640B01k3Q8j35M7R1j03j7l6O5k2O4J1j24R5o4L6k3k6PQ3n2j0Q6q0j1P1l7j4
$$ plain form
877218 285 297 290 223 313 292 319 224 253 257 318 240 251 289 362 262 372 279 305 388 375 303 266 251 252 290 327 266 336 269
880825 269 341 344 269 367 287 238 329 311 270 309 308 249 264 214 328 265 276 300 310 319 298 218 297 233 241 252 206 157 132 274
884543 274 269 243 188 273 261 261 316 289 192 183 294 242 235 224 280 244 185 278 182 219 309 218 324 226 313 234 216 227 233 149
888262 149 204 298 218 221 197 271 208 237 177 187 161 209 218 235 164 263 289 244 216 187 163 198 137 186 82 105 216 95
891732 95 175 184 263 214 167 242 294 191 206 227 286 242 193 240 351 196 208 226 229 267 237 279 248 190 189 247 198 243 121
895327 121 220 185 191 238 164 156 167 160 219 208 220 254 268 223 170 243 197 215 128 213 131 162 305 201 201 117 195 243 147 173
899045 173 118 189 227 252 266 185 209 194 219 262 171 273 241 158 149 239 164 259 249 143 191 158 175 112 104 169 159 179 201
902640 201 178 266 131 178 269 166 149 113 178 156 220 231 107 202 138 174 151 125 132 215 163 153 239 159 148 219 182 168
906092A68K9m8O6L1p5l6k4M1Q2q2N8p9Lm3l5N8K8j20J50K2j8j29P6jJ9mOq2K8
909687H9P5J5NLn4N8o1K1M5oj37J09j0k0m7N6o3Q8n8L6r6O5oO8r5K7R2K8l4q1
913405A12N0m6L4QK8l6k9M3m6K5k0m1R3l5o4N9n3K2M3lK7pn4O4l2L5m0l6J9KK7
917248A49J7Q2k9j8j9jo0o6O8l0Qj8J21q5j9k6J11j27R3q1K6K8ok4K0J9j5J6%
920842A34o6J1K8M3m6K4j5Oq3MN5j1K7Nj0mo9J28j15Q7m7k4L0l4M3k7J20Qj15
924437H7l5pN9p7K4K1j8Q5n0j11M4j31o7L33l7Nn8k0N4Kk8O0J3j8j4k9o8L3K6
928031G8M6l6k1O1k8n8R4m5m4P4m0NL7j2Jl4M8MO1r0L5O0r4J38p9l4n3O8j9k3
931750A00n9P1o8M6j28O3R2lml0K9qp0L6O9n0M0j4m1L2K4j1p3O8l5L2j0k9k7m2
$$ plain form
906092 168 197 149 215 246 171 135 111 152 234 152 210 131 134 91 56 114 142 22 172 194 176 47 123 122 141 137 143 61 89
909687 89 164 179 184 187 133 191 130 151 196 190 53 162 152 132 85 141 78 166 108 144 48 113 107 175 80 107 199 227 193 112
913405 112 162 116 150 158 186 150 121 164 118 143 123 82 175 140 76 135 82 104 147 144 171 164 110 174 142 177 137 101 120 122 149
917248 149 166 248 219 201 182 181 121 55 123 93 101 83 204 119 100 74 185 58 151 70 96 124 118 94 114 133 118 134 134
920842 134 68 79 107 150 104 128 113 119 36 40 95 84 111 116 106 102 33 161 46 133 86 62 92 58 101 74 194 202 87
924437 87 52 45 104 27 51 72 54 139 89 -22 22 -109 -176 157 120 125 67 47 101 103 75 135 148 130 116 87 19 52 78
928031 78 124 88 67 128 100 42 136 91 47 121 81 86 123 111 112 78 126 130 191 101 136 196 102 240 161 127 74 142 123 100
931750 100 41 112 44 90 -38 25 117 114 110 80 109 101 31 67 136 86 126 112 71 103 127 116 43 111 76 108 98 69 42 0
935468@J04J5p0K0Q0K1n8L7Jk9k3K6q2M2K2k0R4J9K5o3m9lj7l8M1p5N7P6n3Pj9
939311H8M6KL3r2OO6r6N5Lo7J3M6jk4m7J7K5n9L8K6j22J16K5n8K3J0l9Q5o3r9
943029d4J22J9n3m1J40j49Q0rjo2K4l2J18p1Jo0J5M5Q0l8m7m4K9n5O7o4Q6m1P0
946624H5r0M6o2J03l1mok4l9M4j2N4n5KMj0pK9o3P9l5k6PQN3M2j21J8N6L0j36
950466f1Q5Qk7MM9m1l5J04Lo2L3j3N1Pn3o3L6q0L8r7n3K8M2l5J27n2L6q5J12J5
954185B1L1j14J09J8L6l4N3M7N3N9L7M6J14J62K67O13Q15o93p72m11j20o8j4r1
957172A64l8m1R9p5j1J01l0j2j9n3Q0r5J4n0R6j9pj8J2k9kj3RJ13o3L6%l1N8K0
960890A96Rp4M3J1MK7j1K5P2R3m2K4K24K13L01Q39J76j016m83j93r9r6l6k6N1
$$ plain form
935468 0 104 119 49 69 149 170 112 149 150 121 98 124 42 84 106 86 180 199 224 161 112 109 92 54 95 20 77 153 100 107 88
939311 88 134 136 169 77 83 149 53 108 111 44 57 103 102 78 31 48 73 14 52 78 -44 72 97 39 62 72 33 118 55 -44
943029 -44 78 97 44 3 143 -6 74 65 64 2 26 -6 112 41 42 -18 -3 42 122 84 37 -7 22 -33 34 -30 56 15 85
946624 85 -5 41 -21 82 51 47 41 17 -22 22 10 64 9 11 15 5 -2 27 -36 43 8 -18 -11 -3 50 92 -29 -11 45 75 -61
950466 -61 24 32 5 9 58 17 -18 86 89 27 60 47 98 105 52 -11 25 -55 -17 -114 -167 -139 -97 -132 -5 -57 -21 -106 6 21
954185 21 52 -62 47 65 101 67 120 167 220 279 316 362 476 638 905 1518 2333 1640 868 457 337 269 255 164
957172 164 126 85 184 109 98 199 169 157 138 85 165 70 84 34 130 111 104 86 98 69 67 54 63 176 113 149 149 118 176 196
960890 196 205 131 174 185 189 216 205 230 302 395 353 377 601 814 1115 1954 2130 1114 631 438 339 243 207 181 232
964001B32l5M3n2k3M6j2Kl5l1j3N8n2N3p1N0qn6rL2qO0m2l8M3j51J74L1P5J8J
967720B82q0K4q3m3K1l3k2N0j9J28j63K7l9J0j25PkP0n5L5J1J15j29l4P8m0l4
971066d3R7J1n5J7PM1n9M4L3j56J09j7jl3K0o1J18m7Kr1P0PJ2qn8M0M8K1lo8Q8
974909H5o6j6J0Q5r2J01r8Q1k0r0j08L3n6P0jN9m3O3k7L3l6m2P9P5m2l6J9J07
978379A27J59%L3R4M7O4N0M8K40O92J15n38p14k80j38J04j37J33q6N5q6%k7R0
981336D5k9POP4r6L2o1O8o2P5p1k5o3j9R0O4j9l8Nlj5L6m4P0k7k0m8R2j3J05J00
985178B16P1nJ43LQ8n8J52M05O09k62o08m73k07n9J20p0M5p8m3j02J8J59k8Q0
988165A16O0r9k0m9O0m9M6p7R7QL6j08R5o3N5o0KJ8R7n2LK8m9Mk1lM9p3R6j02
$$ plain form
964001 232 197 240 188 165 211 199 201 166 135 122 180 128 181 110 160 152 96 87 119 111 171 129 91 134 -17 157 188 263 281 282
967720 282 202 226 143 100 121 88 66 116 97 225 62 89 50 60 -65 -58 -60 10 -45 -10 1 116 -13 -47 31 -9 -43
971066 -43 54 65 10 27 34 75 16 60 93 -63 46 29 28 -5 15 -46 72 25 27 -64 6 13 25 17 -41 -1 47 68 65 -3 85
974909 85 19 3 13 98 6 107 9 90 70 -20 -128 -95 -151 -81 -82 -23 -66 -3 -30 3 -33 -75 4 79 37 1 20 127
978379 127 286 286 319 413 460 524 574 622 862 1554 1669 1131 417 137 -1 103 -34 99 13 68 -18 -18 -45 45
981336 45 16 23 29 103 7 39 -22 46 -16 59 -12 -37 -100 -119 -29 35 16 -22 -17 -20 -35 1 -43 27 0 -20 -68 24 11 116 216
985178 216 287 282 425 428 516 458 610 1015 1624 1362 754 281 74 15 135 65 110 32 -11 -113 -95 64 36 116
988165 116 176 77 57 8 68 19 65 -12 85 93 129 21 116 53 108 48 50 68 165 113 116 144 95 99 78 75 124 51 147 45
991884D5j3ML2K9O8o3m6k0R9j31K0o1M3m6N4j39N1m8J62n2M9j32K8M1l6o5J86
995243E9j49Q1j10J60j13J10J3J9j11J41j36J55r9M1Prk6K5p4Pl7L2J8pJ18lr0
998589B2J3n2K8j0K03j97K9j3j3j78K9j20O4k3R6o4R8j5j31j27k5p1J41P1K03
1001670d2q4j5q1J85o9J66J1K78J13J02l6J38R2J91l8J26J0K99m7J03n16n8k23
1004533F05n4j37M3j2j3k09J69k27J01j20J31r6R0qJ66J8Nj67N2n5Q9j87Q0k61
1007489CJ2J34L66n1n5k26j8j28J25n0J58o0K70Q1J82L8K35j08J72k0K21o4J65
1010352A382R5K35o4k08l12j08r4j26j45M6j30M7m3k5j59J70j74J54j59J02n2J35
1013073E67K6L8p4J03k19J43j33J3m6J79j08k56n75K49J87M24r7k6j30K26j89J54
$$ plain form
991884 45 32 36 68 97 165 102 56 36 135 4 24 -37 6 -40 14 -125 -74 -122 40 -12 37 -95 -67 -26 -62 -127 59
995243 59 -90 -9 -119 41 -72 38 51 70 -41 100 -36 119 20 61 68 59 33 58 -16 -9 -46 -14 4 -3 115 112 22
998589 22 35 -17 11 1 204 7 36 23 10 -168 -139 -259 -195 -218 -122 -186 -88 -103 -234 -361 -386 -457 -316 -245 -42
1001670 -42 -126 -141 -222 -37 -106 60 71 349 462 564 528 666 758 949 911 1037 1047 1346 1299 1402 886 828 605
1004533 605 551 414 457 445 432 223 392 165 266 146 277 181 271 263 429 447 452 285 337 282 371 184 264 3
1007489 3 15 149 515 464 409 183 165 37 162 112 270 210 480 561 743 781 1016 908 1080 1060 1281 1217 1382
1010352 1382 1477 1712 1648 1440 1128 1020 926 800 655 701 571 618 575 550 391 561 387 541 382 484 432 567
1013073 567 593 631 557 660 441 584 451 464 418 597 489 233 -342 -93 94 518 421 395 265 491 302 456
1015812D56k13J34j42J10j70K41k33K06k26J93k36K15k44L04j75N06l92q5k59J58
1018285A48k96K38k50K19k69J40q9L38j94J69k57K63k52J73l02L25l46K75k87J76
1020776g8Kr3r33O08Q27J017r19n48m27O76l21J5k12L32m34K49m08L42m10N22o51
1023373h44N26l84N44m47O10m57N88m00Q25o90M04n60Q49o51P35n13J049o70J054
1025722A568n52J635K59L040j107R0p92L433K724P124K654P223L555J0067P139
1027575D8060J9313J8243M7572Q3390J90210k0295k00004q2714m2337j1889j3160
1028945C6389k063o400n26m825P40k680J398k203K354j581j388l397M20k004K81
1030810A4515j649P84j233N92j230P82j134Q04j112R80q65R32r51J234k71K611
$$ plain form
1015812 456 243 377 235 345 175 416 183 389 163 356 120 335 91 395 220 726 334 249 -10 148
1018285 148 -148 90 -160 59 -210 -70 -159 179 -15 154 -103 160 -92 81 -221 104 -242 33 -254 -78
1020776 -78 -76 -169 -1102 -494 333 1350 431 -117 -544 132 -189 -174 -386 -54 -488 -239 -647 -305 -715 -193 -844
1023373 -844 -318 -702 -158 -605 5 -452 136 -264 561 -129 275 -285 564 -87 648 135 1184 514 1568
1025722 1568 1016 2651 2910 5950 4843 4933 4141 7574 10298 17422 20076 27299 30854 40921 48060
1027575 48060 67373 85616 133188 216578 406788 386493 186489 103775 61438 49549 36389
1028945 36389 34326 27926 27400 22575 23315 20635 22033 19830 22184 20603 19215 15818 16238 14234 14515
1030810 14515 12866 13650 12417 13009 11779 12561 11427 12231 11119 12099 11234 12166 11215 12449 12178 14789
1032787A4789K88j39j517K157J797O155L602N621L751Q049O424J4639J5620L2841
1034529A14077N2619J45270J29265j64713j40227n3344k4009j0482o969l830l171
1035898C4486k678j740p04l67m59R4P49k049k748j487p90q04o52o85m29m62m80
1037999A8795m66l74l59l59o75j33j92n3l48n1l89ok10q3l80j56k54m1m00j27k92
1040596A3447J28l36k53P2j59l57N26P39j25j398n43K66N66k42o7p0K05k13K63
1042945A2449j95k3k06Qk40o5k08Oj15p9l15Jj92l6k02q8k46k34l59J53j20J10
1045684I804j07j07j94m4p6M9k91L5j93J6j65n7k04j16rK0j52R3k94m3m40k55J10
1048547G380N32Rk4l53j78j09r2qJ7j82O1j25N8n5o9j56M5j42Qj07P6l2J68l9K2
$$ plain form
1032787 14789 15077 14938 13421 15578 17375 23530 27132 32753 36504 44553 50977 65616 81236 114077
1034529 114077 166696 311966 441231 276518 136291 82947 58938 48456 41487 37657 34486
1035898 34486 31808 30068 29364 28997 28538 28632 29381 27332 24584 23097 22307 21503 20851 20166 19737 19275 18795
1037999 18795 18329 17955 17596 17237 16562 16429 16237 16184 15836 15785 15396 15390 15180 15097 14717 14561 14307 14266 13866 13739 13447
1040596 13447 13575 13239 12986 13058 12899 12542 13068 13807 13682 12284 11741 12007 12573 12331 12264 12194 12399 12186 12449
1042945 12449 12254 12231 12025 12033 11793 11728 11520 11526 11411 11332 11017 11018 10826 10790 10588 10500 10254 10020 9661 9814 9694 9804
1045684 9804 9697 9590 9396 9352 9276 9325 9034 9069 8876 8892 8727 8670 8466 8350 8341 8361 8209 8302 8008 7965 7525 7270 7380
1048547 7380 7912 7921 7897 7544 7366 7257 7165 7157 7174 6992 7053 6928 6986 6931 6862 6706 6751 6609 6617 6510 6586 6554 6722 6683 6705
1051628F705j53J06j62J00j53J0j36p2p1J13j48L0j05N5j21O2k42Q7j18l0j42J12
1054367E727j29K5k09P1R9J12l1j30k74n2j01N8n6J2p6K1q1L7n3N0j61J24j49j3
1057323D821j6Mj4P3Q4J9R6J00J3j05N2O0j77M5j75ro7O3j40J72r0l7k2J7KM2j56
1060682D655N9K4N6r1J2J9n1r4m8j90J45J7J28j17K8j12J07j05K9k3l2j17J11p1
1063669D339po5N9k6J7n9N8j80M3P9O5j11P0KN0j06j7r0L2m4K8j44J38k22J42p9
1066892C972M0k4J7k2J09q1j9k2K0j26Q5m6N9K8l2o0j11m5M4k5N7p7k9j3P3j80
1070096C592K9M7m3o6O5qJ2o6k3p1P0n9Qo7Pr6L6J00K5j16K3L2n3j43J73j36P2
1073455C344j03R7o5k2n1M8K1n1m0k5N9N6j43l2o5R8m1J31o6N7n8k7P4Jj52O7k5
$$ plain form
1051628 6705 6552 6658 6496 6596 6443 6453 6317 6245 6174 6287 6139 6169 6064 6119 5998 6060 5818 5905 5787 5757 5615 5727
1054367 5727 5598 5623 5414 5485 5584 5696 5665 5535 5261 5209 5108 5166 5110 5122 5046 5067 4986 5023 4970 5020 4859 4983 4834 4821
1057323 4821 4805 4809 4795 4868 4952 4971 5067 5167 5180 5075 5127 5187 5010 5055 4880 4871 4804 4867 4727 4899 4809 4772 4750 4767 4769 4811 4655
1060682 4655 4714 4738 4794 4703 4715 4734 4683 4589 4541 4351 4496 4513 4641 4524 4552 4440 4547 4442 4471 4448 4416 4299 4410 4339
1063669 4339 4332 4267 4326 4300 4317 4258 4316 4136 4179 4258 4323 4212 4282 4284 4334 4228 4211 4121 4153 4109 4137 3993 4131 3909 4051 3972
1066892 3972 4012 3988 4005 3983 4092 4011 3992 3970 3990 3864 3949 3903 3962 3990 3958 3898 3787 3742 3786 3761 3818 3741 3712 3699 3772 3592
1070096 3592 3621 3668 3625 3559 3624 3616 3628 3562 3539 3468 3538 3479 3487 3420 3427 3331 3367 3467 3492 3376 3399 3431 3378 3235 3408 3272 3344
1073455 3344 3241 3338 3273 3251 3200 3248 3269 3218 3178 3153 3212 3268 3125 3093 3028 3126 3085 3216 3150 3207 3149 3122 3196 3197 3045 3112 3087
1076802C087j45k2J8J2m3M4k3l0n6l9R9p1m9o3P3p6j7O7M0Q%p5J6m4JpJ2m5rq4
1080520B579J00j20P2j7om1L0l2R9j39P5qQk6L7p0Q2m5J06%jq0J28k49R9j07K2
1083848B496k6K6n6Jn7L9j3j7j2K3m0jpJ7j49J67Rn2M0K8p5J58q4N4r6o8j09J2
1087319B208n6O0Oj7K2P5j25R7k7m0ql4o6PK4PK1M2mj8K0L6r1P4L4L2N4%rp0l0
1091161B224J7n2n5o8L5MJ3p9J13l1L1m5mJ2O9q7OJ12l7k04N3j51J34p9J82j92
1094384A921J59j19K9L9n7J4K1k1%kk3P6j6k3K4o0P2M0P6MJ34J28N9k7O5j64qq1
1097867B260QK1J11J50K09O47Q39o86q57l29l4k00l0JO9j82J78k07J20r4Q9j06
1100606A977O4p1Ok0rk8NoN1nl1k9l7J1o5K4R2J7pO1l3L3J12k5J75R6K43O3k6k86
$$ plain form
1076802 3087 2942 2920 2938 2950 2907 2951 2928 2898 2842 2803 2902 2831 2782 2719 2792 2716 2699 2766 2806 2814 2814 2739 2755 2711 2712 2705 2717 2672 2663 2579
1080520 2579 2679 2559 2631 2614 2608 2567 2597 2565 2664 2525 2600 2592 2600 2574 2611 2541 2623 2578 2684 2684 2683 2603 2731 2482 2581 2474 2496
1083848 2496 2470 2496 2440 2441 2384 2423 2410 2393 2381 2404 2364 2363 2356 2373 2224 2391 2400 2348 2388 2416 2341 2499 2415 2469 2373 2305 2196 2208
1087319 2208 2152 2212 2218 2201 2223 2298 2173 2270 2243 2203 2195 2161 2095 2102 2126 2133 2154 2196 2192 2174 2194 2230 2139 2213 2247 2279 2333 2333 2324 2254 2224
1091161 2224 2241 2189 2134 2066 2101 2105 2118 2039 2152 2121 2152 2107 2103 2115 2184 2097 2103 2215 2178 1974 2027 1876 2010 1931 2113 1921
1094384 1921 2080 1961 1990 2029 1972 1986 2007 1986 1986 1984 1961 2037 2021 1998 2022 1962 2034 2074 2150 2154 2288 2416 2475 2448 2513 2349 2341 2260
1097867 2260 2268 2289 2400 2550 2759 3406 4245 3559 2702 2373 2339 2139 2109 2110 2179 1997 2175 1968 2088 1994 2083 1977
1100606 1977 2041 1970 1976 1956 1947 1919 1924 1918 1969 1964 1933 1904 1867 1878 1813 1837 1929 1946 1939 2000 1967 2000 2112 2087 2262 2358 2601 2664 2638 2352
1104324B352o0j48l6J31P9K66L41R07Q7j025m55l02m3j22M8n6N0n5o8%j1k3Q0q6
1107281A851j6n9J51j51m5m0J17l2K3K5J7p9l8k6O8m9O2K7m6M7k2M8P5r2N2P8Q8
1110640B034oM3k31k4lk5r9o0R6M2r0K0m2K8m4R2o1pj02O0r2R8r8N9J4m5M5R9j26
1114234A575Q6o5n2K3K2Pl7k2J02mr9J9q8l1J09l4N2L4k9m9L4l3n3rN3l0KJ0Q7
1117829A580n0n2l2O6q4l1RP3k1ok9K9P2r4l4P0p9J7k7lN4k2Mj1k3P3o0Lq2O2j8
1121671A354k4L1M0j8M4j39mJ2l3J04N6r6K1o1N6p8J22o5j8lL8q0K4ppP9r5O4K3
1125266A340o1PPn6O7rj19J74o5l0QN0p6n5N8ln0L4%P9j12j8L9N5K5j2l8p0L3L1
1128984A233Kj5k6M2m0P7m7Nk5NrL5j02J25p3L1m5J03r4N6n8L2K3l9Rpq1P3o2J04
$$ plain form
1104324 2352 2292 2144 2108 2239 2318 2584 2925 3832 3919 2894 2439 2137 2094 1972 2020 1964 2014 1959 1891 1891 1880 1857 1937 1851
1107281 1851 1835 1776 1927 1776 1731 1691 1808 1776 1799 1824 1841 1762 1724 1698 1766 1717 1779 1806 1760 1807 1785 1833 1908 1816 1868 1946 2034
1110640 2034 2028 2071 1840 1816 1813 1788 1689 1629 1725 1767 1677 1697 1655 1683 1639 1731 1670 1663 1561 1621 1529 1627 1529 1588 1602 1557 1602 1701 1575
1114234 1575 1661 1596 1544 1567 1589 1596 1559 1537 1639 1635 1536 1555 1467 1436 1545 1511 1563 1597 1568 1519 1553 1520 1467 1458 1511 1481 1483 1493 1580
1117829 1580 1530 1478 1446 1512 1428 1397 1406 1479 1458 1452 1423 1452 1524 1430 1396 1466 1387 1404 1377 1374 1428 1406 1410 1399 1376 1449 1389 1392 1310 1372 1354
1121671 1354 1330 1361 1401 1383 1427 1288 1284 1296 1263 1367 1423 1327 1348 1287 1343 1265 1387 1322 1304 1301 1339 1259 1283 1276 1269 1348 1253 1317 1340
1125266 1340 1279 1286 1293 1237 1304 1295 1176 1350 1285 1255 1263 1313 1237 1182 1240 1237 1187 1221 1221 1300 1188 1170 1209 1264 1289 1277 1239 1169 1202 1233
1128984 1233 1235 1220 1194 1236 1196 1273 1226 1231 1206 1211 1202 1237 1135 1260 1187 1218 1173 1276 1182 1238 1180 1212 1235 1196 1205 1198 1117 1190 1128 1232
1132703A232m1O8n6k1Lp7mK9J0K2L4m2n4L6O3Lo9N6l9L2j9j3L0m5kL9Q4j32j0l
1136421A114j5L0pL0l7kj1N8j14R2k5O7j17Q4m7JmN3n8R8j14M4m6R0j3n5k6P2m7
1140016A095k0N6Nr4J48o1k6n3L3NjO2l0r6O7L7nj8k3jrJl0k8N3n7J15j13N9m1
1143734A030P5p4K2n9M6K2K1j08N6QM5o6rK5n0K7l6M2L6n3R8K3l2r4M0o9j2J5Q6
1147329A055m5l3K2O0m1mp7J09r3R9j6J2j4P7j14K7l9k4L7l7k0k5m3k7L7P5l6l2
1150812H90m6P9O2Q4j07K6p3N6K7j4q6j5
$$ plain form
1132703 1232 1191 1259 1203 1182 1185 1108 1104 1133 1143 1165 1199 1157 1103 1139 1202 1205 1136 1192 1153 1185 1166 1153 1183 1138 1136 1175 1259 1127 1117 1114
1136421 1114 1099 1129 1122 1152 1115 1113 1102 1160 1046 1138 1113 1180 1063 1147 1100 1101 1097 1150 1092 1190 1076 1120 1074 1164 1151 1096 1070 1142 1095
1140016 1095 1075 1131 1136 1042 1190 1129 1103 1050 1083 1088 1087 1149 1119 1023 1090 1127 1122 1104 1081 1080 1071 1072 1042 1014 1067 1010 1125 1012 1071 1030
1143734 1030 1105 1031 1053 994 1040 1062 1083 975 1031 1039 1084 1018 1009 1034 984 1011 975 1017 1053 1000 1098 1121 1089 995 1035 966 954 969 1055
1147329 1055 1010 977 999 1059 1018 1014 937 1046 953 1052 1036 1048 1034 1111 997 1024 985 961 998 961 941 916 873 846 883 958 922 890
1150812 890 844 923 985 1069 962 988 915 971 998 984 898 883
##END=
