##TITLE= Lecture Unknown #1
##JCAMP-DX= 5.00 $$From Command Line Converter 1.0
##DATA TYPE= NMR Spectrum
##DATA CLASS=  XYDATA

##ORIGIN= Exported from Command Line Converter 1.0
##OWNER= SVB
##$URL= http://wwwchem.uwimona.edu.jm:1104/software/jcampdx.html
##SPECTROMETER/DATA SYSTEM= NUTS EXPORT
##.OBSERVE FREQUENCY= 75.480980
##.OBSERVE NUCLEUS= ^1H
##INSTRUMENTAL PARAMETERS= 1H
##XUNITS= PPM
##YUNITS= ARBITRARY UNITS
##XFACTOR= 0.0002649674
##YFACTOR= 18.6016040000
##FIRSTX= -17.388486
##FIRSTY= -17605.000000
##LASTX= 247.578900
##NPOINTS= 32768
##MAXY= 18426210.000000
##MINY= -175394.000000
##DELTAX=   0.008086
##XYDATA= (X++(Y..Y))
$$ [...]
231838a153j407K89O61P99R50K43J69M41O83M36q04r27J97J191L96j073j011l87
232388c07N21K0o15k43j137q00N76O99k33p65O30J010M47n5k52R8k77o94j370
232968b747m47O28J539O35p00j089j84K28k89o61m47M65J436J393N98l97m36j157
233517a632l81O98N6M3N01O85M43N31J463M35j660j984j252j46j13m13l02O08
234066b420J596J736J706l2p87p38o57j79l19K81P04l16q04k56m00j41k12Q80
234616c58J034J229O53k38j372j217k42K0k28l34m64M62Q44mo42%J595J838N91
235195C167j180j869p46m69k06N02J371J000P16K94k44J85J058j23j113J89K09
235714B741J09J96l89p47j138j782n48O98O07J055P28p00j228j075l38p42j498
$$ plain form
231838 -1153 -2560 -2271 -1610 -811 139 382 551 992 1675 2111 1307 380 577 1768 2164 1091 80 -307
232388 -307 214 234 -381 -624 -1761 -2561 -1985 -1286 -1519 -2284 -1654 -644 -197 -252 -504 -406 -683 -1377 -2747
232968 -2747 -3194 -2566 -1027 -392 -1092 -2181 -2365 -2137 -2426 -3087 -3534 -3069 -1633 -240 358 -39 -475 -1632
233517 -1632 -2013 -1315 -1259 -1216 -715 -30 413 944 2407 2842 1182 -802 -2054 -2200 -2313 -2726 -3028 -2420
234066 -2420 -824 912 2618 2586 1799 1061 404 225 -94 187 891 575 -229 -485 -885 -1026 -1238 -358
234616 -358 676 1905 2558 2320 948 -269 -511 -491 -719 -1053 -1517 -1055 -211 -215 -857 -857 738 2576 3167
235195 3167 1987 118 -628 -1097 -1303 -801 570 1570 2286 2580 2336 2521 3579 3456 2343 2532 2741
235714 2741 2850 3046 2657 1910 772 -1010 -1558 -860 -253 802 1530 830 -398 -1473 -1811 -2553 -4051
236233d051p75K98j87o72l59L10N75P49J009P27L12n21M53J852J216P27N97k87
236782A973k98J221P59j272q18l7j30k91q81m69J77Q64Q90r96j124J542K441N62
237332D113o46m62o83l12J06P35o29r99n53j469j119r40j052m81Q25R25J86l94
237881b849j76J189K567K032P57L66j27j963j685J47j29j556k261j799J226K822
238370a439O29j042q04j61R66K08KK56L80J234J261J39m60j23Pk66L6j05j200
238949d82p20j25L87P51N94p6k27j54J13P40J024q3q16Q81R31o45n59N54L7p21
239560A404j029q09r20n98j90J66j64k8N92M7j002n66J35j73J80K44K14J40Q1
240139b276P12J182K91l78k24L7N11O66j10j74O47m94j297o15r06j128j245Q85
$$ plain form
236233 -4051 -4826 -4528 -4715 -5387 -5746 -5436 -4861 -4112 -3103 -2376 -2064 -2585 -2132 -280 936 1663 2260 1973
236782 1973 1675 2896 3655 2383 1565 1528 1398 1107 226 -243 -66 798 1688 692 -432 1110 3551 4113
237332 4113 3467 3005 2322 2010 2116 2851 2222 1223 670 -799 -1918 -2858 -3910 -4391 -3566 -2641 -2455 -2849
237881 -2849 -3025 -1836 731 2763 3520 3886 3759 1796 111 258 129 -1427 -3688 -5487 -4261 -1439
238370 -1439 -810 -1852 -2656 -2817 -1851 -1643 -1641 -1385 -1005 229 1490 1629 1169 1046 1053 787 823 718 -482
238949 -482 -1202 -1327 -940 -189 405 329 102 -52 61 801 1825 1742 926 1807 2738 2093 1534 2088 2125 1404
239560 1404 375 -434 -1354 -1952 -2142 -1976 -2140 -2168 -1576 -1529 -2531 -3097 -2962 -3135 -2955 -2711 -2497 -2357 -2276
240139 -2276 -1564 -382 -91 -469 -693 -656 -145 521 411 237 884 390 -907 -1522 -2428 -3556 -4801 -3916
240689c916K506J373R6k14l09o7Q35O19K05L18L44q80n60j52m47o27j996k003
241238d875o09N24J655J316J450M99q52r41j43P88J417M60q55o54j152m86M39
241757b019o1N94J879R51k8J60k12m20q6l0K98P8o49r04j031n30N72Q54J325J002
242367A743n49j558r38L45J16n03j67j52P36J492N66p72j593q09L22J320J418
242886A017J262P38j023k288j307J894J961Q30O08O93p98l187k323q50L81R11
243375a481J002J168J431R23j74j426j215P67J796J563O46p95q93q83j920j121
243863f12jM21J229J386P72J341J767J119J10l24j410j696j470p75l9o8j079q49
244412a78m8k84l10j115j76L07k1k45J54j45m38L09J98q84O91J868J972J939J509
$$ plain form
240689 -3916 -1410 -37 59 -155 -464 -531 304 923 1128 1446 1790 910 350 198 -249 -876 -2872 -4875
241238 -4875 -5484 -4960 -3305 -1989 -539 -40 -892 -1833 -1976 -1188 229 689 -166 -820 -1972 -2458 -2019
241757 -2019 -2080 -1486 393 1344 1316 1476 1264 844 758 728 1026 1104 455 -449 -1480 -2010 -1438 -584 741 1743
242367 1743 1194 -364 -1302 -957 -841 -1344 -1511 -1663 -927 565 1131 359 -1234 -2043 -1721 -401 1017
242886 1017 2279 3017 1994 -294 -1601 293 2254 3084 3692 4385 3587 400 -1923 -2773 -2392 -1481
243375 -1481 -479 689 2120 3043 2869 1443 228 995 2791 4354 5000 4205 3312 2429 509 -612
243863 -612 -613 -192 1037 2423 3195 4536 6303 7422 7532 7208 5798 4102 2632 1857 1818 1750 671 -178
244412 -178 -226 -510 -820 -1935 -2111 -1804 -1825 -2070 -1916 -2061 -2499 -2190 -1992 -2876 -2185 -317 1655 3594 5103
244992E103q60j877o20m72j63N54j40m87M19J65l42K72n4l95l62o37q75J087J428
245572A744k66M8J97Q4l99k62N20Q49N51l27P92Q63M44r3p35n39K9l2k15n85j086
246213A582k98M65l67n19K52L90j03j193j117j362j966r38p7J192K578J894K14
246731F27o54q21M72N68M9L79M93M96pn57n4M83J336J146Lj271j502j202m81M51
247342d6j78j775j502L23J657J497J711K144Q09j108j775k247o82Q92J069q59
247830g0k079q54l02M48J150J075Q08M56p05j057J057J729k51j297k10N25n75
248349a52k68J086Q56n9j07k12Q26K58l69L94L97k77m75Q7O62Q04K07q05k430
248929D23l060j150J422J685R45Q48m08j529k38J341M93p37k26o3K04J342n7j099
$$ plain form
244992 5103 4243 2366 1746 1274 1111 1665 1525 1038 1457 1622 1280 1552 1498 1103 741 104 -771 316 1744
245572 1744 1478 1526 1723 1807 1408 1146 1666 2515 3066 2739 3531 4394 4838 4745 4010 3471 3500 3468 3253 2668 1582
246213 1582 1284 1749 1382 863 1115 1505 1402 209 -908 -2270 -4236 -5174 -5251 -4059 -1481 413 627
246731 627 -27 -848 -376 192 241 620 1113 1609 1602 1045 991 1474 2810 3956 3959 2688 1186 -16 -497 -46
247342 -46 -224 -1999 -3501 -3178 -1521 -24 1687 3831 4640 3532 1757 -490 -1172 -280 789 -70
247830 -70 -2149 -3003 -3305 -2857 -1707 -632 176 632 -73 -1130 -73 1656 1405 108 -102 423 -152
248349 -152 -420 666 1522 1463 1356 1144 1970 2228 1859 2253 2650 2373 1898 1985 2647 3451 3658 2853 423
248929 423 -2637 -3787 -2365 -680 265 1113 705 -824 -1062 279 772 35 -191 -254 -50 1292 1235 136
249478A36j136l01P01P34N21M37p5J56J200j27r16o47m40J43j438j436j7J358
250027a147Q93j95j784j125K73l58J55K34R52K296J800O6j651k564j014L52P50
250546b067Q19J74k96o20j170m43R62P95p58j697j423l14J613J798J255L63O35
251065c74Q28K7j711j501Q1n2L25P6m77O04J400Q57J208J081L89l47j327m87J4
251645F14O0N43J68O4M78M08N0J59K33J6k96m03o83q14q85l12J652J718J86m7
252255B909J99K90kj144Q4k37r80n3J29L17k1p93j373j378m95K041K155P46l07
252835B087q91p56j334j298J38K25J50R27N56l56l52j230j589q95K93J744K042
253354e39J420L99P26O40j25L45M67R18O04n09j139o85p36q77r62n62m31m27Q9
$$ plain form
249478 136 -1000 -1301 -600 134 655 1092 1017 1173 2373 2246 1330 683 243 386 -1052 -2488 -2505 -1147
250027 -1147 -254 -449 -2233 -3358 -3085 -3443 -3288 -3054 -2102 194 1994 2060 409 -2155 -3169 -2817 -2067
250546 -2067 -1248 -1074 -1370 -1990 -3160 -3603 -2641 -1846 -2604 -4301 -5724 -6038 -4425 -2627 -1372 -1009 -374
251065 -374 454 481 -1230 -2731 -2650 -2702 -2377 -2301 -2778 -2174 -774 83 1291 2372 2761 2414 1087 600 614
251645 614 674 1217 1385 1449 1927 2335 2385 2544 2777 2793 2497 2094 1411 597 -288 -600 1052 2770 2956 2909
252255 2909 3108 3398 3396 2252 2336 2099 1119 1066 1195 1512 1491 698 -675 -2053 -2548 -507 1648 2394 2087
252835 2087 1196 440 -894 -2192 -2054 -1829 -1679 -752 -196 -552 -904 -2134 -3723 -4618 -4325 -2581 -539
253354 -539 881 1280 2006 2646 2521 2866 3333 4251 4855 4346 3207 2522 1786 909 -53 -615 -1046 -1473 -1384
253934a384m98q02r9J357K049K011J021L81M55k71p35j407j038K07o66j004R18
254453D95K326J471N37N19Q0K88M54k26j262o55L87J119O55r48j271l3J96q4J96
255032D244J482K035N18j164q18q49o80r87m31M81K0m16l65L17J8p96p49m96r20
255612D44n43O51J210q0m83O19J100M12k9J41l38m74p27M39J306o5n83L6j26J36
256223C046k58j209p21M19M25N55l64j269n07J048L62m16J93J99r72j207j6P93
256772A01L52m78K68R8q32k09j45p01Q7L67K42J097M80l38q17j407q62O59J664
257352c74J336l16n10L40L49k79n21k37L16J37l51r04r97r58P93J302K82j43L81
257932c54P52P93m32J33K63L83J183K23j389m21J980K621J193r31j849j413l44
$$ plain form
253934 -1384 -1882 -2684 -2783 -1426 623 2634 3655 4036 4491 4220 3485 2078 1040 1247 581 -423 495
254453 495 2821 4292 4829 5348 5428 5716 6170 5944 4682 4027 4414 5533 6188 5240 3969 3936 4132 4048 4244
255032 4244 5726 7761 8279 7115 6297 5448 4768 3781 3350 3831 3851 3435 3070 3387 3405 2609 1860 1364 444
255612 444 -99 552 1762 1682 1199 1818 2918 3330 3301 3442 3104 2630 1903 2342 3648 3583 3000 3036 2910 3046
256223 3046 2788 1579 858 1277 1702 2257 1893 624 117 1165 1527 1111 1304 1503 531 -676 -692 101
256772 101 453 -25 243 341 -491 -700 -845 -1546 -1459 -1092 -850 247 727 389 -428 -1835 -2697 -2038 -374
257352 -374 962 646 136 476 825 546 25 -212 104 241 -110 -1014 -2011 -2969 -2176 -874 -592 -735 -354
257932 -354 398 1191 759 892 1155 1538 2721 2944 1555 1134 3114 5735 6928 5997 4148 2735 2391
258451B391J026R47p69j683o15J165K361J558L08j150j718j501j746r21J074J563
258939B290N70N25J471J18k215j619k73o40p88J71M97K63n65m17K92o2m16R8o55
259519a355j182M72N03J77J544K057J798o4l51p02j654p76N05Q5k145k057M15
260038b730J964J617P78L69J15r86j958p14L17O61R27J59m17M44J659J047K86
260556C538o97j727j240r23J60j67n0J097J129k79j426j881j273J78O86p7k81
261075c233l74m3R77J275M20j352j308q07m86M04K18M18P53k0l2K05N57P94N8
261655a576l02L22M9p41L4J476M40r09j113P0J107Q30R60k07j868j856j864r69
262204f117K05L60l57m39n58J11K153K864K223L48o47p39p03j240j177N65J913
$$ plain form
258451 2391 3417 4364 3595 1912 1297 2462 4823 6381 6689 5539 3821 2320 574 -347 727 2290
258939 2290 2860 3385 4856 4974 2759 1140 867 227 -561 -390 107 370 -195 -612 -320 -382 -798 -700 -1355
259519 -1355 -2537 -2065 -1562 -1385 159 2216 4014 3950 3599 2897 1243 467 972 1057 -1088 -3145 -2730
260038 -2730 -766 851 1629 1998 2113 1127 -831 -1545 -1228 -567 360 519 102 546 2205 3252 3538
260556 3538 2841 1114 -126 -1049 -889 -1056 -1106 -9 1120 841 -585 -2466 -3739 -3561 -2875 -2952 -3233
261075 -3233 -3607 -3650 -2673 -1398 -978 -2330 -3638 -4445 -4931 -4527 -4309 -3891 -3138 -3158 -3190 -2985 -2428 -1634 -1576
261655 -1576 -1878 -1556 -1507 -2248 -2214 -738 -298 -1207 -2320 -2250 -1143 -313 647 440 -1428 -3284 -5148 -6117
262204 -6117 -5912 -5552 -5909 -6348 -6906 -6795 -4642 -1778 445 793 146 -593 -1296 -2536 -3713 -3148 -1235
262723a235J317m35j437j630o09J117J948N20m65j35M4m31r48M45K704J696N18
263242B984k09m05m78k84p25p77o23r1J063J018j77n26j62j092k191j328P33O13
263791b657J38M72J202Q87J30j94n22l80r55j514j2Q52N29N81k24m9j71K66J526
264371i5P64J40J554J823R73l55j526j330p57r23j136p8O59J093J185J023J36
264890C150r17j415j08R87J172J013m14j130o06q80m58P75J334J971N58p79j306
265409B947r84n96j315M15K701J192o48r05j372k062k977j953J3l69l91O93J433
265927d178J253J264J062P21O41M88m64o67m75J56L6J34R04Q11m58j275l20Pj161
266507a521r61j34k00l80J45J370J314o14L6O70P45K26r97j078j202N2Q14J194
$$ plain form
262723 -1235 82 -353 -1790 -3420 -4029 -2912 -964 -444 -909 -1044 -1000 -1431 -2379 -1934 770 2466 2984
263242 2984 2775 2370 1892 1608 883 106 -517 -608 455 1473 1296 770 608 -484 -2675 -4003 -3270 -2657
263791 -2657 -2519 -2047 -845 42 172 -22 -544 -924 -1879 -3393 -3405 -2553 -2024 -1443 -1667 -1716 -1887 -1621 -95
264371 -95 669 809 2363 4186 5159 4804 3278 1948 1191 268 -868 -946 -287 806 1991 3014 3150
264890 3150 2233 818 710 1697 2869 3882 3468 2338 1732 852 394 1169 2503 4474 5032 4253 2947
265409 2947 1963 1367 52 467 3168 4360 3712 2807 1435 -627 -3604 -5557 -5544 -5913 -6304 -5611 -4178
265927 -4178 -2925 -1661 -599 122 763 1251 787 120 -355 -199 -163 -29 875 1686 1228 -47 -367 -360 -1521
266507 -1521 -2482 -2616 -2816 -3196 -3051 -1681 -367 -981 -945 -275 470 696 -301 -1379 -2581 -2529 -1715 -521
267057e21J963N87m12q10l52Q38M09K18n0j22O17O41M71p66j867m26J516J771
267606C705L18n59j18K48n92n17K30p75m31k95j333j085r86o01k31N98J069q6
268156a441q62n83L84O03J096K44r75P12J297m86p76m10l49M15L53J42Q57J188
268705A409Q23o2n69L15N6j879j56R44m23K47O78j6k77K7k01Q25J005N8m66j02
269315B236p69j228j087M70J929J580m51L9R49K03o22k151k691j867l33R37J05
269834b751r58l24J631J203J75l99n09q27K57J014J126lj48J46Q54M00k87J493
270383B093K067J223N41k37k151j472r67r61J80O9jL71J268R11l97o29j081j221
270933c94J39O17Oj127j330J056Q60k86j36n21j17M92m9L59N60l72k70J324J262
$$ plain form
267057 -521 1442 2029 1617 807 455 1293 1702 1920 1870 1748 2365 3006 3477 2711 844 418 1934 3705
267606 3705 4023 3464 3346 3594 3002 2485 2715 1940 1509 1214 -119 -1204 -2190 -2791 -3022 -2424 -1355 -1441
268156 -1441 -2303 -2886 -2502 -1899 -803 -559 -1534 -822 475 -11 -787 -1197 -1546 -1131 -778 -636 221 1409
268705 1409 2232 2170 1601 1916 1972 93 -63 881 458 705 1383 1367 1090 1117 916 1741 2746 2804 2338 2236
269315 2236 1467 239 -848 -378 1551 3131 2680 2719 3668 3871 3249 1098 -1593 -3460 -3793 -2856 -2751
269834 -2751 -3709 -4033 -2402 -1199 -1024 -1423 -1932 -2759 -2502 -1488 -362 -365 -513 -367 487 887 600 2093
270383 2093 4160 5383 5924 5687 3536 2064 1097 136 316 385 384 755 2023 2934 2537 1908 827 -394
270933 -394 -255 362 368 -759 -2089 -1033 -173 -459 -595 -1116 -1233 -741 -790 -431 129 -243 -513 811 2073
271513B073K61m71p55j249q97k39O81J038J24k0K37q68j103p91r05P0J00J344
272062a370J500L34m50j72l50p21q38q90l5j72K82N12L00K16J477J049k07m67
272611bp0K33l91o19k8R06J224k4J57J83q48r33nm80q71p33o86j80J19J062J357
273252f29J098P55O72M07n08M0Q42M71N11k50l07j72m80j85n08j11J65N89M5O0
273862B505R79k29j750j426r78j204j228j023Q8J845K487J665p76o83P0M67R88
274381A797R59N65N70o98j516L46O68m10j57l95M20J401P09K3p76o52l02r33j178
274961D41j082k64N17J046J161K91n5M66M72n5q35n67q02j783j686J02Q85M05
275510a343p01n30r01r35P11K42r32Q97J963O98j33K31L96o5n31n56p26k72J13
$$ plain form
271513 2073 2334 1863 1108 -141 -1038 -1277 -596 442 566 546 783 -85 -1188 -1979 -2884 -2814 -2714 -1370
272062 -1370 130 464 14 -158 -508 -1229 -2067 -2957 -2992 -3164 -2882 -2370 -2070 -1854 -377 672 465 -2
272611 -2 -72 161 -230 -849 -877 29 1253 1229 1386 1569 721 -212 -217 -697 -1568 -2301 -2987 -3167 -3048 -1986 -629
273252 -629 469 1224 1896 2303 1795 1835 2677 3148 3659 3409 3102 2930 2450 2265 1757 1646 1811 2400 2445 2505
273862 2505 3484 3255 1505 79 -899 -2103 -3331 -4354 -4266 -2421 66 1731 955 272 342 809 1797
274381 1797 2756 3321 3891 3193 1677 2023 2691 2281 2124 1729 2149 3550 4259 4282 3506 2854 2552 1619 441
274961 441 -641 -905 -388 658 1819 2110 2055 2521 2993 2938 2103 1536 734 -1049 -2735 -2633 -1748 -1343
275510 -1343 -2044 -2574 -3475 -4410 -3699 -3457 -4389 -3492 -1529 -831 -964 -733 -337 -402 -933 -1489 -2215 -2487 -2374
276090b374j09j13j3O3J364M00j835j837m1O40K312J596l58j562k16M12M21n27
276640a777j127m15O98J067R77J323M54n46k08n8n58j547o30R74J595M60N2N15
277189A249n43j202k34J33K42J094J214l10j017J75n4J38O94K016J624o90j180
277708C349o93R5J017j81j823k410q01Q89Q28j002m02J003J737P29k63j376k392
278227a696k078N62K042J046m67m97Q06J567L00n61J68J080P57k13q08n98n25
278745H85j312q33L74Q61J642J12j191o01Q89J617J191j374k109r78J76k7j274
279264a952j463M95J578J025k75j007l84L15K75j429j560k31K200J904P20K36
279752D47k78o42m08P70P78J92J50m27o23j388j497P42J750L70m75j099j391M84
$$ plain form
276090 -2374 -2483 -2596 -2609 -2546 -1182 -782 -2617 -4454 -4495 -3855 -1543 53 -305 -1867 -2083 -1671 -1250 -1777
276640 -1777 -2904 -3319 -2621 -1554 -577 746 1200 654 446 388 -170 -1717 -2347 -1373 222 682 734 1249
277189 1249 706 -496 -730 -597 -355 739 1953 1643 626 801 747 885 1579 3595 5219 4529 3349
277708 3349 2656 2751 3768 3587 1764 -646 -1447 -558 270 -732 -1134 -131 1606 2335 2072 696 -1696
278227 -1696 -3774 -3212 -1170 -124 -591 -1088 -282 1285 1585 1024 1192 2272 3029 2816 2008 1410 885
278745 885 -427 -1260 -886 -25 1617 1729 538 -63 826 2443 3634 2260 151 -827 -651 -678 -1952
279264 -1952 -3415 -2920 -1342 -317 -592 -1599 -1983 -1668 -1393 -2822 -4382 -4613 -2413 -509 211 447
279752 447 169 -473 -881 -111 667 859 1009 582 -41 -1429 -2926 -2184 -434 -64 -539 -1638 -3029 -2545
280302b545J362L93j335j794q95Q11M00o0J79J31J98J128R54o96m74L74j00m86
280851b455o5J150J978R90O79l95K06P86K30k54L06M80j73j037j398j156M21R37
281401A230O22J118o7l41j3l07K00J02J78Q2q83j379j365o83o42k30K48o64k74
281980c068R05M76k8o74o67N73J318J17p76p52l73l47l62O29N20O24J152L26j72
282560e79J102L74N8K71N61k04j803j253r80o56o18M89J406J355N16m71n02r4
283110a028Q15N94l55K45P86L45l18k99j03o15j217p79m33j26l58K04J951K073
283659A382p6k743k494j240MJ219P82l19k20J13L49j438j750j83J263J945J424
284178a982Q24J070M22j98M35j4p56L13N7n95K78J02m74j305j401j316o99M76
$$ plain form
280302 -2545 -1183 -790 -2125 -3919 -4814 -4003 -3603 -3663 -3484 -3353 -3155 -2027 -1073 -1769 -2243 -1869 -1969 -2455
280851 -2455 -2520 -1370 608 1598 2277 1882 2088 2874 3104 2850 3156 3636 3463 2426 1028 -128 293 1230
281401 1230 1852 2970 2903 2562 2549 2242 2442 2544 2722 2804 1921 542 -823 -1506 -2148 -2378 -2130 -2794 -3068
281980 -3068 -2163 -1687 -1715 -2389 -3056 -2483 -1165 -1048 -1824 -2576 -2949 -3296 -3658 -3029 -2509 -1885 -733 -407 -579
282560 -579 523 897 955 1226 1787 1583 -220 -1473 -2453 -3109 -3727 -3238 -1832 -477 39 -432 -934 -1028
283110 -1028 -213 381 26 271 1057 1402 1084 785 682 67 -1150 -1929 -2362 -2488 -2846 -2642 -691 1382
283659 1382 1306 -1437 -3931 -5171 -5167 -3948 -3166 -3485 -3705 -3592 -3243 -4681 -6431 -6614 -5351 -3406 -1982
284178 -1982 -1158 -88 334 136 571 557 -199 114 171 -424 -146 -44 -518 -1823 -3224 -4540 -5239 -4763
284727d763j09M25J156N58n0j57K08o63j555p52Q92K498K729R03q05n79j66r0
285276c20N07n6n71J97J561R34j403k922k616p10J503J814R83P75O87Q53Q8n47
285826G57j391r23m45q09j65K10Q71J837P57o77r90p01j033J93J785J895K89j160
286375C00o14j356k086p82K63R54J16j129o70j21P60J032J227J037J223J418L09
286894A881k50o23L38Q91q1m76j16k25M07R14O69L03Q09o5j224j897j386M37J901
287474B207K334P36j492k487k301k11J240k12o85L57k91P5Q83J86j117j264k53
287993b295J045M25j024K04J279L15r1J2n81r44o57j98N24J46m9N40J098P52j16
288572C85N97J537P25J65O72J46r48j379l56O8J18k95p27o41j80j32o25n83l80
$$ plain form
284727 -4763 -4872 -4447 -3291 -2733 -2783 -2940 -2732 -3395 -4950 -5702 -4810 -2312 417 1320 515 -64 -230 -320
285276 -320 187 131 -440 -243 1318 2252 849 -2073 -4689 -5399 -3896 -2082 -1099 -324 363 1216 1304 757
285826 757 -634 -1557 -2002 -2811 -2976 -2766 -1895 -58 699 22 -968 -1669 -2702 -2509 -724 1171 1460 300
286375 300 -314 -1670 -3756 -4538 -4275 -3321 -3205 -4334 -5004 -5125 -4365 -3333 -2106 -1069 154 1572 1881
286894 1881 1631 1008 1346 2237 2156 1680 1564 1339 1746 2660 3329 3632 4441 4376 3152 1255 -131 306 2207
287474 2207 4541 5277 3785 1298 -1003 -1214 26 -186 -871 -514 -805 -730 153 339 -778 -2042 -2295
287993 -2295 -1250 -825 -1849 -1645 -366 -51 -142 -130 -711 -1655 -2312 -2510 -1986 -1840 -1889 -1349 -251 501 385
288572 385 982 2519 3244 3409 4081 4227 3279 1900 1544 1612 1730 1435 708 67 -113 -245 -870 -1453 -1833
289152a833r60o08L88J041J297N18j023j450q06Q81K78o72n44J55N16M70J214
289671a138Q67L99M18N62L56m31j234j146K93J284J120R51J024p73j538p85k2
290190B07N99l15j485j014j0l21l6J352J605J447l81m4J127R72L6m42m77j835
290739I85j862q41L78R53L88n38m03R9L27J67m07p69J49J013J614J234J26q97
291289A716j289l32J421J610m5k584k923j782p85J94J087J264j64L97J967J572
291777A324K00k93r72j693q49L69o83j896j021O87R48J524J574M8j9k36r10l10
292326b208N11nn44n5J49L44r79k150r74J111K118J818L19r40j792L11J682O34
292876f50P8k1P19R46N09p6N2j458k493j178J400K199R23M51k20oP74M94L77j5
$$ plain form
289152 -1833 -2793 -3401 -3013 -1972 -675 -157 -1180 -2630 -3436 -2555 -2277 -2949 -3493 -3338 -2822 -2352 -1138
289671 -1138 -271 128 546 1108 1464 1033 -201 -1347 -1054 230 1350 2301 3325 2552 1014 229 207
290190 207 806 491 -994 -2008 -2018 -2339 -2375 -1023 582 2029 1648 1604 2731 3703 3739 3297 2820 985
290739 985 -877 -1718 -1340 -387 1 -537 -940 -841 -514 -347 -754 -1523 -1374 -361 1253 2487 2613 1716
291289 1716 427 95 1516 3126 3081 497 -2426 -4208 -4993 -4799 -3712 -2448 -2612 -2215 -248 1324
291777 1324 1524 1231 259 -1434 -2283 -1914 -2597 -4493 -5514 -4827 -3879 -2355 -781 -733 -752 -988 -1898 -2208
292326 -2208 -1697 -1702 -2246 -2301 -2152 -1808 -2787 -4937 -5911 -4800 -2682 -864 -545 -1485 -3277 -2966 -1284 -650
292876 -650 -572 -593 126 1072 1581 1505 1557 99 -2394 -3572 -2172 27 950 1401 1181 1175 1949 2443 2820 2805
293486B805m86j150j219n0K47k55j084n59l2k13p67r70j87j77o17O47O83r1P50
294066b725J634J123M2J9n46L07J363J035j61k49j49n05k22l73j340p61P33Q01
294615B6l98j045m21Q95J239J016n84o92R16J586O40o23j529j071n81j6P62R20
295164A040P10p22j532n21O29L12m26j97q67p18N17P05M26Q73J282L73l91l11
295714A182L36j14j00M47Q0oN11Kk04o52j148j996k65J606J534P19L11M4M94%
296324B781L7o13j153K05K18K40P91J324O94r02n68l71r97k11N7n88j417j586
296874b059p88j199M5J731J732P4n53L57M40J05O76J008J322J49m32l65n97j69
297423A477o06p47j386j339j453r47l11Q33K615K393J66L45M58J22M64j45K04
$$ plain form
293486 2805 2319 1169 -50 -100 147 -108 -1192 -1751 -1783 -1996 -2763 -3733 -3920 -4097 -4714 -4067 -3384 -3475 -2725
294066 -2725 -1091 32 74 93 -453 -146 1217 2252 2091 1842 1693 1188 966 593 -747 -1508 -775 26
294615 26 -372 -1417 -1838 -943 296 1312 728 36 952 2538 3178 2555 1026 -45 -626 -642 120 1040
295164 1040 1750 1028 -504 -1025 -396 -84 -510 -707 -1574 -2292 -1775 -1070 -644 229 1511 1884 1493 1182
295714 1182 1518 1404 1304 1751 1831 1825 2336 2338 2134 1482 334 -1662 -1927 -321 1213 1932 2243 2287 2781 2781
296324 2781 2818 2205 1052 1257 1475 1715 2506 3830 4524 3622 3054 2683 1686 1475 1532 944 -473 -2059
296874 -2059 -2847 -4046 -4001 -2270 -538 -464 -1017 -660 -220 -115 561 1569 2891 3040 2608 2243 1646 1477
297423 1477 871 124 -1262 -2601 -4054 -5001 -5312 -4479 -1864 529 695 1040 1498 1620 2084 1939 2143
297942B143J63k105k907j239Q94J048N02J261J043M64L87r1j051k25Q44L32J51
298460A614p93j370j161l00L06K03J70j29k13j120l24R89J818P41j165j543j964
298979d241k08J190J354J466q5r47l72o25j280l26J520P37o47m71q55n94J197
299498c187J363R77L68m96j401r84J428K723R25N9Q90O95m09q60jJ82l45R8n35
300078A490j500r05K80J454J155M52l46j32k77r51q8P52R45L55k93k99o30j355
300627A07j426j120j247m38q8j39k72k06L1N90J848J889P4r72m12l49P35O77N43
301207a75J137N84L25L34J67j03j33K80P81K61q28j610r96R44J000n71r84l0L52
301787G35m04o97qP51O47m90l51p57r09m4Q53J389O50K50Q29J393R00O9j532j912
$$ plain form
297942 2143 2306 201 -2706 -3945 -3051 -2003 -1501 -240 803 1267 1654 1563 512 287 1131 1463 1614
298460 1614 821 -549 -1710 -2010 -1704 -1501 -1331 -1460 -1673 -2793 -3117 -2128 -310 431 -734 -2277 -4241
298979 -4241 -4449 -3259 -1905 -439 -524 -1471 -1843 -2468 -3748 -4074 -2554 -1817 -2464 -2935 -3790 -4384 -3187
299498 -3187 -1824 -847 -479 -975 -2376 -3360 -1932 791 1716 1775 2665 3360 2951 2091 2090 2272 1927 2025 1490
300078 1490 -10 -915 -635 819 1974 2426 2080 1948 1671 720 632 1384 2329 2684 2391 2092 1462 107
300627 107 -1319 -2439 -3686 -4124 -4212 -4351 -4623 -4829 -4798 -4208 -2360 -471 -397 -1369 -1781 -2130 -1395 -718 -175
301207 -175 962 1546 1871 2205 2372 2269 2136 2416 3197 3458 2630 1020 24 968 1968 1397 413 383 735
301787 735 331 -366 -374 377 1024 534 183 -574 -1483 -1527 -674 715 1365 1615 2444 3837 4737 4806 3274 1362
302397A362j709k90J096R7j270j328m17l66J14Q71J027L60j668j470Q25J316R07
302916e43R78N49j45K81N28R68o0o28J82J53J4L18q42j075M02P92j79j485p21
303496e13k65o67P59J697Q37J82o8p43p41qo50m77J087J283N16k49r50j545j368
304076a883p11j05K24k3R96K288J017j090j034L8K69L38R28M22M62q7o67q74j314
304655h06p41k16O64J349J558P61L91O27o32j936l74N21K80M98K21k83L35k6m96
305235A695m94j279j523j482j81K214Q78l92P68K126J513Q8n68m34j249k259r66
305754a545K67O70K35K57K15K81o0o57K58L19M53M83L49J24m97N04L89N84k36
306334B393L86J159l43j097r08p94K77J155O49J217K371J528j032l602k924r48
$$ plain form
302397 1362 -347 -637 459 556 -714 -2042 -2459 -2825 -2711 -1840 -813 -453 -2121 -3591 -2766 -1450 -543
302916 -543 435 984 839 1120 1648 2616 2556 1928 2110 2263 2277 2595 1753 678 1080 1872 1693 208 -513
303496 -513 -778 -1445 -686 1011 1848 2030 1962 1219 478 470 -180 -657 430 1713 2229 1980 1030 -515 -1883
304076 -1883 -2594 -2699 -2475 -2498 -1502 786 1803 713 -321 -283 -14 324 1252 1674 2136 2049 1382 508 -806
304655 -806 -1547 -1763 -1099 250 1808 2569 2960 3587 2955 1019 645 1166 1446 1944 2165 1882 2217 2191 1695
305235 1695 1201 -78 -1601 -3083 -3264 -1050 -172 -564 204 2330 3843 3931 3363 2929 1680 -579 -1545
305754 -1545 -1278 -608 -373 -116 99 380 320 -337 -79 240 693 1176 1525 1649 1152 1656 2045 2629 2393
306334 2393 2779 3938 3595 2498 1590 796 1073 2228 2877 4094 6465 7993 6961 3359 435 -513
306823e13j2L6o88k89L6p46j344l29J020J475R78L00n78n75P51J271R16M06m90
307402A625j653n79K04L69R34J341L71j237j032o13n03o1M49N68M90K46q73K9
307952G5J429R26nJ14j111k054j544l55J053J374N12K4Q87J363J497J53q78O6
308501C526Q4k27j542k026r09j00L12J241N01l78o5P64M14j181j435r40o93l27
309050b981k36p32o92N41J131P58J15l97N13J391J535M28k37J042O75J42m53j269
309599A274r08j42M68K95m83l07J13j8J46q2l57k66L6P27K08l33QK04J045K53
310210A881j162j133j91j09p38p03q24m45J005J755J205N27p75o81J41l1J00K57
310759G9j182r26R58J873O95p96o41K61L25K7L29o80j104n75K20J163J169L05
$$ plain form
306823 -513 -525 -489 -1177 -1466 -1430 -2176 -3520 -3849 -2829 -1354 -376 -76 -654 -1229 -478 793 1709 2115 1625
307402 1625 -28 -607 -403 -34 900 2241 2612 1375 343 -270 -773 -834 -385 183 673 919 46 75
307952 75 1504 2430 2425 2539 1428 -626 -2170 -2525 -1472 -98 414 438 1325 2688 4185 4338 3460 3526
308501 3526 3610 3383 1841 -185 -1094 -1194 -882 359 860 482 417 1181 1595 414 -1021 -1961 -2654 -2981
309050 -2981 -3217 -3949 -4641 -4100 -2969 -2211 -2096 -2493 -1980 -589 946 1374 1137 2179 2854 2996 2543 1274
309599 1274 366 224 692 987 504 197 310 292 438 356 -1 -267 -231 496 704 371 379 583 1628 1881
310210 1881 719 -414 -605 -714 -1452 -2155 -2979 -3424 -2419 -664 541 1068 293 -388 -247 -278 -178 79
310759 79 -1103 -2029 -1071 802 1497 701 60 321 646 673 1002 322 -782 -1357 -1137 26 1195 1500
311309A500k63j55J72N65Q45k37j167q66m6N43l86j541l57J052J395J785R28j062
311858B705q66O22M68j131j988r29k61O51J329J182J067N59L64Q25J103K77l84
312377E593l10j917k195m29J348P76m38j609k57Q13n15j150j57J68q2k57J50O88
312926B20j9q86o18R4P89J499J253O78K18j843j558j98Q99J600J616Q61n36l65
313475C704q77j786k892j753j01j58N43J596J113K6m99j088j944r27J436J243
313964b364J257J479J213P53n02k43M50J277Q47o03r10l91j75M5M81nP16J429
314513D754J183P06J2k245k354j730r12K37K26k53j95l30q42K12j38j308K89J474
315062a214J495J243R27J76r16j249j693k03K066K180Q11p73j98o1J391J104l49
$$ plain form
311309 1500 1237 1082 1254 1819 2664 2427 1260 394 348 891 505 -1036 -1393 -341 1054 2839 3767 2705
311858 2705 1839 2461 2929 1798 -190 -1119 -1380 -729 600 1782 2849 3408 3772 4597 5700 5977 5593
312377 5593 5283 3366 1171 742 2090 2866 2428 819 562 1375 860 -290 -447 -279 -361 -618 -468 220
312926 220 201 -685 -1303 -1209 -420 1079 2332 3010 3228 1385 -173 -371 528 2128 3744 4605 4069 3704
313475 3704 2827 1041 -1851 -3604 -3705 -3863 -3320 -1724 -611 -585 -1084 -2172 -4116 -5043 -3607 -2364
313964 -2364 -1107 372 1585 2338 1836 1593 2043 3320 4167 3564 2654 2263 2088 2133 2614 2609 3325 4754
314513 4754 5937 6643 6655 4410 2056 326 -586 -349 -123 -376 -571 -901 -1743 -1531 -1669 -2977 -2688 -1214
315062 -1214 281 1524 2451 2627 1711 462 -1231 -1434 632 2812 3623 2850 2652 2591 3982 5086 4737
315581D737j353j162J59K39L28J74O09M1j037r69q03L38M60O68P82O74N46j34
316131D297j010j649l69L88j221j994j063O41L56p39j68M59R14Q61J008O31Q45
316650B187J096P81J071k3j54P1j622q70N31R66N39n53o66k10j89k64m54k09O56
317229B684R37R07L04p74j096l52j442j868J34J115M05O86K91M63J360R17l29
317748D342q4L06n93j436j861k424k113J36R88J163J464O73P98J551R80k1n97
318267C272o78l52P24L78j303j263O02M07j235j415j048J13J384J290M65r31j033
318786f23j239q90O30J46N91P12M03R81M22Q10N03l20M00L27j095j511k01J555
319335A601J251m72n60n12l51o31o12k75L74M48J41n20j486o35O75M46P82mr95
$$ plain form
315581 4737 3384 2222 2381 2620 2948 3122 3731 3772 2735 1766 963 1301 1761 2429 3211 3885 4431 4297
316131 4297 3287 1638 1269 1657 436 -1558 -2621 -1980 -1624 -2363 -2531 -2072 -1158 -297 711 1342 2187
316650 2187 3283 4064 5135 5112 4958 5029 3407 2537 3068 4034 4573 4020 3354 3144 2955 2691 2237 2028 2684
317229 2684 3621 4528 4832 4058 2962 2610 1168 -700 -566 549 954 1640 1931 2394 3754 4671 4342
317748 4342 4258 4564 3971 2535 674 -1750 -3863 -3727 -2739 -1576 -112 561 1359 2910 3890 3869 3272
318267 3272 2594 2242 2966 3344 2041 778 1380 1787 552 -863 -1911 -1798 -414 876 1341 410 -623
318786 -623 -1862 -2752 -2122 -1976 -1385 -673 -270 711 1133 1943 2446 2126 2526 2853 1758 247 46 1601
319335 1601 2852 2380 1820 1308 957 326 -286 -561 -187 261 402 -118 -1604 -2239 -1564 -1118 -336 -340 -1335
319915a335k44J100P47O81K49p38r43m6J069J256P90P27N42L65n77j310p66j53
320464A414n09l62l77J573K459J473q9q92r90n25m91m33O1p94N91J459K07n86
321014C189j333k782k477m89J399K695J913j78N59P36n35r77j439j331l90J05
321502a335o61m78j033j037M7N04q98r86l64J284K022O10r85p01l7J74J474R88
322051a412R9J733R77p25j02N14k46n67o32j433j109N4J051J104J648P34j317
322570C71j020N97J176L38l92m87j8O41J295J358N46J08J02o33j580j938j219
323089g55j15J278J666Q36oM2M14NJ73ql98P26J047k04j952j809kJ762J853j116
323699C437k207j597j390j87j71j129p44N28N96O84J160J339M67L31R00O85P19
$$ plain form
319915 -1335 -1579 -479 268 949 1198 460 -483 -529 540 1796 2586 3313 3855 4220 3643 2333 1567 1414
320464 1414 905 543 166 1739 4198 5671 5582 4690 3700 3175 2684 2251 2312 1518 2109 3568 3775 3189
321014 3189 1856 -926 -3403 -3892 -2493 202 2115 1937 2496 3232 2697 1720 281 -1050 -1440 -1335
321502 -1335 -1996 -2474 -3507 -4544 -4497 -3993 -4891 -5877 -6241 -4957 -2935 -2325 -3310 -4011 -4048 -3874 -2400 -1412
322051 -1412 -1313 420 1397 672 570 1084 838 271 -361 -1794 -2903 -2849 -1798 -694 954 1688 371
322570 371 -649 -52 1124 1462 1070 583 565 1206 2501 3859 4405 4513 4615 3982 2402 464 -755
323089 -755 -870 408 2074 2910 2904 2946 3360 3365 3538 3530 3132 3858 4905 4701 2749 940 938 2700 4553 3437
323699 3437 1230 -367 -1757 -1944 -2115 -3244 -3988 -3460 -2864 -2180 -1020 319 786 1117 2017 2702 3421
324218C421R85P10l91j008p84j106m44M32L39r03p76P52l07k214j760j029k21
324737d304J382Q48Q9l87M14K138J368L10j91r86q10Q05jq8J059J51j662j086
325286i51J55P75P33j71j10j90J40J097J089q69p76O83J162O45o62l32N39M21
325836C378m53r8L06k98j33J77j676k765j035M20O49K35j35K51l2l22M37K82n05
326415a317L17J408L70P6Q08J004Q44N46O63L46K58O53n52j461q35q25j747j345
326965g89M49P98l25j073k48Q33R33M45j07p16p49R47J489L46O75J056j21l10
327514C533N20O0j25O81J376J283j26n63j434k084j167m98o62K1k76j506m09J037
328063c39R54L81p64n94N73Q97p0j037q34J42P84P61J596J271o4o90o99j015o42
$$ plain form
324218 3421 4406 5116 4725 3717 2933 1827 1383 1815 2154 1251 475 1227 920 -1294 -3054 -4083 -4304
324737 -4304 -2922 -2074 -1985 -2372 -1958 180 1548 1858 1667 681 -129 676 675 587 1646 1797 135 -951
325286 -951 -796 -21 712 541 431 241 381 1478 2567 1698 922 1605 2767 3412 2750 2418 2957 3378
325836 3378 2925 2827 3133 2835 2702 2879 1203 -1562 -2597 -2177 -1528 -1293 -1428 -1177 -1209 -1531 -1094 -812 -1317
326415 -1317 -1000 408 778 854 1662 2666 3510 4056 4719 5065 5323 5976 5424 3963 3128 2303 556 -789
326965 -789 -340 458 133 -940 -1188 -355 578 1023 916 200 -549 398 1887 2233 2908 3964 3843 3533
327514 3533 4053 4113 3988 4669 6045 7328 7202 6639 5205 3121 1954 1456 794 815 539 -967 -1376 -339
328063 -339 615 996 232 -362 211 1108 1038 1 -833 -691 93 854 2450 3721 3657 2967 2268 1253 611
328643F11j400j461n01J014J880K003J893J258Q59m28j381k256j801p53M18Q69
329131H24J242O28J67j96p11J02K79j96M12M08n42M36J378l82j093j99l8J3j109
329711A423p26J002R51L29K07n92j449l73O96l33p32K67M38M58J040O06o69j141
330261A402j058l15J449J230m06m24K72J187N60j162j570j070M25J584j51k104
330749a51k779j597J2M81k79R5J000J108O77Q73J155N18m13n09J77K54O71J300
331298B593R33r47j459r41J549K458K95j934j716P22R91l67l29L63M92N22j66
331817C059l71k00j294j439j49J58mN7n8j033p75R42J764J109L40K88K85r2J22
332397B709n77o88K01O28p19j203J6m12o65o29K54J189J63N83M67j458j276k54
$$ plain form
328643 611 -789 -2250 -2751 -1737 143 2146 4039 5297 6156 5728 4347 2091 290 -463 -45 824
329131 824 2066 2694 2861 2665 1954 2056 2335 2139 2551 2959 2417 2853 4231 3849 2756 2557 2519 2532 1423
329711 1423 697 1699 2650 2979 3186 2594 1145 772 1468 1135 403 670 1108 1566 2606 3212 2543 1402
330261 1402 344 29 1478 2708 2302 1878 2150 3337 3897 2735 1165 95 520 2104 1953 -151
330749 -151 -2930 -4527 -4515 -4034 -4313 -4218 -3218 -2110 -1433 -560 595 1113 700 191 368 622 1293 2593
331298 2593 3526 2579 1120 179 1728 4186 4481 2547 831 1553 2544 2177 1848 2211 2703 3225 3059
331817 3059 2688 2488 1194 -245 -394 -236 -240 -183 -241 -1274 -2049 -1107 657 1766 2106 2394 2679 2587 2709
332397 2709 2132 1444 1645 2273 1554 351 367 -45 -710 -1339 -1085 104 267 850 1317 -141 -1417 -1671
332946a671K6M0O62N5k48J265K37J00N08q9K26p0p22j179n74J6O08j06m69K80
333557a105N37j22o88R98K114K069P64K28K2n40K8p07j920k346j365N42J745J405
334106A659J244N09o30j306j053J46O6M6M36N72J06j09n27j050p92R34K390R68
334655C609r45r70j040j191o12R74L70j011j656q49P20J274J150M64Q47L61p16
335174G79k058j971O68J554L5m42J230J784K95j449k020j077p11J458K397P07
335663A179o14P37J113p94j484L5J407J251J865J323k35k99k07l85j046j281j132
336181A433j515q12p46n52J04r7N9N57o4N38J275R27R3k33n63n62o88N44J725
336761A423O34p20j590k124j375j424j633J83J451J085J19j02L31J923K739K247
$$ plain form
332946 -1671 -1645 -1605 -943 -888 -1136 129 366 466 974 885 1111 1041 319 -860 -1434 -1418 -810 -916 -1385 -1105
333557 -1105 -568 -690 -1378 -380 1734 3803 4567 4795 4817 4277 4305 3598 1678 -668 -2033 -1491 254 1659
334106 1659 2903 3412 2782 1476 423 569 635 681 1117 1689 1795 1686 1159 109 -683 251 2641 3609
334655 3609 2664 1694 654 -537 -1149 -175 195 -816 -2472 -3321 -2601 -1327 -177 287 1134 1495 779
335174 779 -1279 -3250 -2582 -1028 -993 -1435 -205 1579 1874 425 -1595 -2672 -3383 -1925 472 1179
335663 1179 565 1302 2415 1621 137 172 1579 2830 4695 6018 5783 5484 5277 4892 3846 2565 1433
336181 1433 -82 -894 -1640 -2192 -2088 -2185 -2126 -1569 -1633 -1095 180 1107 1200 967 404 -158 -846 -302 1423
336761 1423 2057 1337 -253 -2377 -3752 -5176 -6809 -6626 -5175 -4090 -3971 -4073 -3742 -1819 920 3167
337249C167N05O58N15O34l97k123k201l24N70k64n92k12P73J144L92K44R28J204
337799D621K08l48n49r93j430M23L027J714j506l015k447r41m58l81K44J266k34
338317g99j453n3N98k29j40J26J063K034j67j487K18Q17Q03J6l79M78L58m30n79
338897G95j445j906q58M11J337M35Q77J726P46p62j393o58J309K12j090n33M85
339416c12R52J032J847N65j050j780j879n86n25n97L81l88p84m68K41K086K986
339935A721J057q82o83o26r92J26O78M5p49l04P72J231M06K11M2K18j66m58n49
340515A098n58j211p68Q23J134L8p99j34J551J991O81K55k93j028j173j051R2
341034F48J885R83j520l18Q71p03P0L43r81k005j368M98J603Q50r40j284m25j15
$$ plain form
337249 3167 3672 4330 4845 5479 5082 2959 758 434 1004 740 148 -64 709 1853 2245 2489 3417 4621
337799 4621 4829 4481 3932 2939 1509 1932 4959 6673 5167 2152 -295 -1236 -1694 -2075 -1831 -565 -799
338317 -799 -2252 -2305 -1707 -1936 -2076 -1950 -887 1147 980 -507 -289 528 1331 1347 968 1446 1804 1374 795
338897 795 -650 -2556 -3414 -3003 -1666 -1231 -354 1372 2118 1356 -37 -695 614 826 -264 -797 -312
339416 -312 640 1672 3519 4084 3034 1254 -625 -1211 -1736 -2333 -1952 -2340 -3124 -3592 -3351 -1265 1721
339935 1721 2778 1896 1213 587 -405 -279 399 444 -305 -609 163 1394 1800 2011 2053 2271 2105 1647 1098
340515 1098 540 -671 -1439 -616 518 556 -243 -377 1174 3165 3846 4101 3808 2780 1607 556 648
341034 648 2533 3516 1996 1678 2549 1846 1916 2259 1278 -727 -2095 -1597 6 856 -84 -1368 -1793 -1908
341583a908n8Q79J476J586M89r19n55ON02j71j595j325j67L54k79j9O56J365J486
342163A803Q43k98l74n23j40m12m66J24p36j314q67k09n28n59M61P54P32Q5R1
342743a533l4q91j75L72m87p43K39N30L42N33O10R3Q9L28R00o3p37J73N83q55
343353g26l25m47r61R8Q41J13M07R63o71r44N16J429J064M38R81J004J61l95r71
343933B575q17n02o42p14q87N63J936J762l4j315n5n3m88l25j028OJ966K097Q8
344513D133p75p80j186j537p46j82K53J50J65k47J93Q93R00R00Q77L35K67j55
345062C458j078m95J98q00j586j709j284k45N00L82r08m14L61J586R20o46j058
345581b818J20P61J716J371l4j174j556o51K0M21J300N65p09n96r6J972K145O24
$$ plain form
341583 -1908 -1966 -1087 389 1975 2464 1545 990 996 1498 1327 -268 -1593 -1760 -1406 -1685 -1704 -1048 317 1803
342163 1803 2646 2348 1974 1451 1311 899 433 557 -179 -1493 -2360 -2569 -3097 -3656 -3195 -2441 -1709 -1624 -1533
342743 -1533 -1567 -2458 -2633 -2261 -2748 -3491 -3252 -2722 -2380 -1847 -1237 -1144 -1055 -727 173 110 -627 -454 129 -726
343353 -726 -1051 -1498 -2459 -2361 -1520 -1407 -1000 -37 -708 -1652 -1136 293 1357 1795 2776 3780 3941 3546 2575
343933 2575 1758 1256 614 -100 -987 -424 1512 3274 3240 1925 1870 1817 1329 1004 -24 -18 1948 4045 4133
344513 4133 3358 2578 1392 -145 -891 -1073 -820 -670 -505 -752 -559 334 1234 2134 3011 3346 3613 3458
345062 3458 2380 1885 2083 1283 -303 -2012 -3296 -3541 -3041 -2659 -3567 -3981 -3620 -2034 -1114 -1760 -2818
345581 -2818 -2698 -1937 -221 1150 1116 -58 -1614 -2265 -2245 -1824 -524 41 -668 -1264 -1360 612 2757 3381
346130C381K1k64j019j084j310k150j321J174J051q56o05J264Q97J026J838J080
346619C123j121q97q94j394m11O79J967J585p5j39j330j777r35n80N67L66n1O81
347168f36L32J98P92J49k56p1l73n92n02p94O76J437K59m85k128k091L90Q37L84
347748b474Q57J049J221K011K190J42j320j174o73RP87K80j28J59q75r7J266O76
348297C906j326j790L53O93r40j468k247m92J077O84K64J517J880R52J92n06o22
348816B127j376j639p06L68J067K05k18n48k74Q75O85m30j237j167K5N95L15J198
349365a35J094k18j533k188q17M00M68P45L0q07o2o51q15p4Q33R77J214J436K00
349945I7k39n44j93J007J925J505P10K31n7j03m3M09l88j056r76l90K30Q1M98
$$ plain form
346130 3381 3402 3138 2119 1035 -275 -2425 -3746 -2572 -1521 -2377 -2982 -1718 -821 205 2043 3123
346619 3123 2002 1105 211 -1183 -1594 -915 1052 2637 2562 2423 1093 -684 -1619 -2199 -1632 -1266 -1317 -636
347168 -636 -304 -106 686 835 579 508 135 -457 -959 -1753 -1077 360 619 134 -1994 -4085 -3695 -2858 -2474
347748 -2474 -1617 -568 653 2664 4854 4996 3676 2502 1829 1838 2625 2905 2777 2936 2061 1964 3230 3906
348297 3906 2580 790 1143 1836 896 -572 -2819 -3311 -2234 -1550 -1286 231 2111 3063 3255 2749 2127
348816 2127 751 -888 -1594 -1226 -159 46 -172 -720 -994 -119 566 136 -1101 -2268 -2243 -1648 -1333 -135
349365 -135 959 741 -792 -2980 -3797 -3397 -2929 -2184 -2154 -2961 -3023 -3674 -4489 -4563 -3730 -2753 -1539 -103 97
349945 97 -142 -686 -879 128 2053 3558 4268 4499 4442 4339 4296 4705 4317 3261 2285 1895 2125 2206 2704
350525B704Q7j625o72k7N59O4j288k37O11R47R52J50l73j246l89j97j479j514
351074b973j37O41N1J57P16J163Q17M46l95K55J772J583O68j416j353j439j370
351593h14j105j050M66R55M91J362J304Q67R32K20l63J5M24R84n43j022l57j3
352142B753m49n49P05J57r71o76o81j189k12J756J815P10p08j96m23j043j257
352661d58p39J5o16J3J357Q36l65J054K236Q82n03M29Q68L16k85q41q63r76j598
353241G62j466N47J095O94R11K91j031j180j81L60l09k87L49L3m40o9L85l0J17
353821E51p33j350O34J982J693N44j26J11M64l22j603l16J159P70O56L10J12o8
354370D468n54j06J39q50j848o23L86Q58J311J6r58p76r12m85l32j79J47N06K93
$$ plain form
350525 2704 2791 1166 494 467 1026 1090 -198 -435 176 1123 2075 2225 1852 606 217 20 -1459 -2973
351074 -2973 -3110 -2469 -2418 -2261 -1545 -382 435 881 486 741 2513 4096 4764 3348 1995 556 -814
351593 -814 -1919 -2969 -2503 -1548 -1057 305 1609 2476 3408 3628 3265 3280 3704 4688 4145 3123 2766 2753
352142 2753 2304 1755 2460 2617 1646 970 289 -900 -1112 644 2459 3169 2461 2265 1842 799 -458
352661 -458 -1197 -1182 -1798 -1785 -428 408 43 1097 3333 4215 3712 4141 5009 5325 5040 4199 3336 2360 762
353241 762 -704 -157 938 1632 2543 2834 1803 623 442 802 493 206 555 588 148 79 464 434 551
353821 551 -182 -1532 -898 1084 2777 3321 3195 3306 3770 3448 1845 1529 2688 3458 4114 4424 4536 4468
354370 4468 3914 3808 3947 3097 1249 626 1012 1870 3181 3197 2239 1463 551 66 -266 -445 -298 208 501
354950E01k14n95J05j6j26M65O8k9p01j451p29p62m68J36m66L19J844K005N56
355530D42n93m98L98N35O96M40n92j044l36J255K561J990q95k044k188q00J633
356049I60J679J566L31mK79k12r3J5j299j871j47Q63R52P18J5n70o81j133j153
356629B15n10K84N03Q31K021J429o42k054q64J129R90j135k556p57m50q55j74
357147b595o78n64j18L81L64L24J42L3J264J869j025k488j053J39n1k83k85K13
357697d411J271J329R67K80m18L32N58k78o16M16Q12P01m96j801j992p76r8l65
358246d585O19Q31J7J061K069J602N32O29O10o21p60k15Q20J863K203P25q96j353
358795E151j317j374k40K80k7l38p15o72r31j048M24R08j558j591L8O30l42r65
$$ plain form
354950 501 287 -308 -203 -219 -345 120 188 159 -542 -1993 -2722 -3484 -3952 -3816 -4282 -3963 -2119 -114 442
355530 442 -151 -649 -251 284 980 1420 828 -216 -552 703 3264 5254 4359 2315 127 -673 960
356049 960 2639 4205 4536 4532 4811 4599 4506 4521 3222 1351 1204 2067 3019 3737 3752 3182 2501 1368 215
356629 215 -295 -11 492 1323 3344 4773 4131 2077 1213 2342 3332 2197 -359 -1116 -1566 -2421 -2595
357147 -2595 -3273 -3837 -3955 -3574 -3210 -2886 -2744 -2711 -1447 422 -603 -3091 -4144 -4005 -4056 -4339 -4624 -4411
357697 -4411 -3140 -1811 -844 -564 -982 -650 -92 -370 -986 -570 242 943 447 -1354 -3346 -4122 -4220 -4585
358246 -4585 -3966 -3135 -3118 -2057 12 1614 2146 2775 3385 2764 2004 1789 2609 4472 6675 7400 6504 5151
358795 5151 3834 2460 2220 2500 2473 2135 1420 748 -183 -1231 -807 101 -1457 -3048 -3010 -2380 -2722 -3687
359345c687k57m17K40J203J978K017Q90l67j774l2J469P30J173J422M9p86r81
359864B870n36j38K04o6k61m22l79p47n71l5k34j080r36j013j175n12N32J109
360413c390J026J123K317K001O44k90r68j353M2J128O11O77k54n80l93j445j495
360932e99j026l65Q26J706J43q87m50L48L90L53P80J44j137j149o26n18K50L82
361481a435Q4o21j224n63j84r47q72n46o04O00K223K045K090J032J26q86j662
362000a344M77K030J677L34k81J12O48R4j73j36k67j42l96J34Q50l11r17n42j75
362580A672N62q50j357j5J052J113J26k12N09J432K14n80L6m07j655r63N97K58
363129A532n86m20J59M64L03R1n58l59p1o92l3K271J817p4j747j494L7L90n06
$$ plain form
359345 -3687 -3944 -4361 -4121 -2918 -940 1077 1967 1600 -174 -206 1263 1993 3166 4588 4637 3851 2870
359864 2870 2334 2196 2400 2334 2073 1651 1272 525 -46 -81 -315 -1395 -2331 -3344 -4519 -5031 -4499 -3390
360413 -3390 -2364 -1241 1076 3077 3721 3431 2463 1110 1152 2280 2891 3568 3314 2734 2341 896 -599
360932 -599 -1625 -1990 -1164 542 685 -202 -652 -304 86 439 1219 1363 226 -923 -1549 -2067 -1817 -1435
361481 -1435 -1351 -1972 -3196 -3759 -3943 -4890 -5762 -6308 -6912 -6312 -4089 -2044 46 1078 1204 318 -1344
362000 -1344 -867 1163 2840 3174 2893 3005 3653 3747 3574 3438 3171 3029 2633 2767 3617 3306 2389 1847 1672
362580 1672 2234 1384 27 12 1064 2177 2303 2091 2600 4032 4246 3666 3702 3295 1640 677 1274 1532
363129 1532 946 526 685 1149 1452 1543 985 626 555 -137 -170 2101 3918 3844 2097 603 640 1030 524
363709E24j754k445j035J002J249J450J697M82m35p64J42K16m12k85L84Q69N99
364228A484n3J64O97K16r79j543k04J71n43l43M46O9o27p05l50P42K54p02r56
364808b762M39M59k74j60O33J719J737Q62n26j955j002K91m95o38J64N78R00J103
365357A073M60M26l92k49KK38p2m55k92l65J73K90p6o36j046o93o9j011K2J610
365967a062Q77o50j068k15J008J175j34j774r32J056J336Q69L64o37j068J03n31
366486a283j249M9R20N33N42J850J959O96j260j597L23Q35P42N42L82K02k07q18
367035C161k49l85j441j723l29nl7R47J048K37m4K97O55P16o25j687o00K42M20
367615E98J514J748O74N26j22j152j231j58K10j03l79p1K47Q85J904J157Ln66
$$ plain form
363709 524 -1230 -3675 -4710 -3708 -2459 -1009 688 1170 735 -29 113 329 -83 -368 16 885 1484
364228 1484 1431 1595 2292 2508 1529 -14 -218 -47 -590 -933 -487 -418 -1045 -1750 -2100 -1358 -1104 -1806 -2762
364808 -2762 -2323 -1864 -2138 -2298 -1665 54 1791 2653 2127 172 -830 -539 -1034 -1672 -1508 -930 -30 1073
365357 1073 1533 1959 1567 1318 1320 1558 1486 1031 739 374 547 837 761 125 -921 -1614 -1683 -2694 -2672 -1062
365967 -1062 -185 -835 -1903 -2118 -1110 65 -69 -1843 -2775 -1719 -383 486 850 213 -855 -752 -1283
366486 -1283 -2532 -2483 -1563 -1030 -488 1362 3321 4017 2757 1160 1483 2318 3060 3602 3984 4186 3979 3161
367035 3161 2912 2527 1086 -637 -966 -971 -1008 -61 987 1224 1180 1477 2132 2848 2223 536 -64 178 598
367615 598 2112 3860 4534 5060 4938 3786 2555 2397 2607 2504 2125 2054 2301 3186 5090 6247 6250 5684
368165E684j655j710P6R35J127N98J31K3n04o77K78R90K59l01M94K67l90k12j169
368744D244l09j068j453Q7L97N4k10n11j173j011J63O24N58M52j097j329Q07J461
369294F86O83L97k93j38M17L3N78J62q45RQ67L13N65Q39j50o19n97l47q37l10
369904A413P72P69J166N3o53p28j363j205K94J64N59J646J384k93j778p69j037
370423C94j257j38R4k43o48j87O71Q59O92n2L31M97M45L75k79j115k126l230j218
371003f135J299Q77k14l6L39M63J840K182P93K41J57j72L7L47L85L29O86J327
371552D745o23j925j951j314N85J303j96j419j151o83L73M35O79J911J050q25
372040I94o24L09m28N06J509O69j74j153j74K01M32R31J265P48P76j061k631j274
$$ plain form
368165 5684 4029 2319 2395 3330 4457 5055 5186 5209 4705 4028 4306 5296 5555 5254 5748 6015 5625 5413 4244
368744 4244 3935 2867 1414 1501 1898 1952 1742 1231 58 -953 -790 -166 392 844 -253 -1582 -775 686
369294 686 1369 1766 1473 1335 1752 1785 2363 2525 1680 1689 2556 2869 3434 4273 4123 3504 2907 2560 1723 1413
369904 1413 2185 2954 4120 4173 3520 2792 1429 224 518 682 1241 2887 4271 3978 2200 1431 394
370423 394 -863 -1001 -907 -1150 -1798 -1985 -1314 -455 237 185 516 1013 1458 1833 1554 439 -1687 -4917 -6135
371003 -6135 -4836 -3959 -4173 -4209 -3870 -3407 -1567 615 1408 1649 1806 1634 1671 2018 2403 2732 3418 4745
371552 4745 4122 2197 246 -1068 -483 820 624 -795 -1946 -2629 -2256 -1821 -1142 769 1819 994
372040 994 370 679 251 757 2266 2935 2761 1608 1434 1635 2067 2998 4263 5011 5787 4726 2095 821
372590H21K09M90K80M19l8k037k097p54K4K63k90p97n71R88K469J434k88j379
373139h54q17M28J737O08n20p56l69M92J46k5M9n19J21j9q22p2J37n11N94J867
373749H95m15j507m99o32j569j204M00O30M83K48N94R26L30o19m56N55J00L52
374299a388J168L87N52n66j657j540J83K508K532K146J623M14n2j417k691j295
374787I07L17K38R8L11j540j920o01J387K218M76Q37K019o9j353r33k84K64N57
375337B929J177K45k035k401j108j001j043l27L06k39L9J89R4M1J234J786J478
375855A364J401K67j272n77K28n34j193r96p00q9R62L31M61O84L71M12P66N30
376405B416l02P83R65J32K25j60p72j42J37j039j462p2P52J99p77l16n71m63O29
$$ plain form
372590 821 1030 1520 1800 2219 2181 144 -1953 -2707 -2683 -2420 -2710 -3507 -4078 -3090 -621 813 525 -854
373139 -854 -1671 -1243 494 1102 582 -174 -543 -51 95 70 119 -400 -279 -298 -1120 -1192 -1055 -1566 -972 895
373749 895 480 -1027 -1526 -2158 -3727 -4931 -4531 -3901 -3418 -3170 -2576 -1650 -1320 -1939 -2395 -1840 -1740 -1388
374299 -1388 -220 167 719 153 -1504 -3044 -2861 -353 2179 4325 5948 6362 6310 4893 2202 907
374787 907 1224 1462 1560 1871 331 -1589 -2190 -803 1415 1891 2728 4747 4678 3325 2392 2108 2372 2929
375337 2929 4106 4351 2316 -85 -1193 -2194 -3237 -3564 -3258 -3497 -3458 -3269 -3175 -3134 -1900 -114 1364
375855 1364 2765 3032 1760 1183 1411 877 -316 -1312 -2012 -2101 -1139 -808 -347 337 708 1120 1886 2416
376405 2416 2114 2897 3862 3994 4219 4059 3287 3145 3282 2243 781 709 1461 1660 883 567 -4 -467 162
376984A62L19p28j715k238j687j70M32R65J084N46J56J054J337J206J64o93o82
377503d88p38j60M57m38r58o62P37J328J72j37J96J16m21j198j007j61J096L61
378052a905o87N28J372J364J093P72M5j215j316j297j580m95m54j183l69n01l65
378571f193J144J805P92j32L37O05M46o08r34q81j463o72J797L074J425m98o30
379090e86L21R87J357Q03j23j066j580j217O69J833J056J47l96q68m03n62p63
379609c91K42J106N93j82j072j532q35K41N44O0L26N52l74P02J408N13l5K64m76
380189A654r63j092o40L82M61oj018m49J756J744J161J51q93j557o73J674J896
380708C588M2j192j139K91K048J360j084k029k185r17Mo71j13R25J39Q40P83k97
$$ plain form
376984 162 481 -247 -1962 -4200 -5887 -6057 -5625 -4660 -3576 -3030 -2874 -1820 -483 723 887 194 -488
377503 -488 -1226 -1386 -929 -1367 -2325 -2987 -2250 -922 -750 -887 -691 -575 -996 -2194 -3201 -3362 -2266 -1905
378052 -1905 -2592 -2064 -692 672 1765 2537 2582 1367 51 -1246 -2826 -3321 -3775 -4958 -5327 -5828 -6193
378571 -6193 -5049 -3244 -2452 -2584 -2247 -1642 -1196 -1804 -2738 -3619 -5082 -5754 -3957 -883 542 44 -586
379090 -586 -265 722 2079 2882 2759 1693 113 -1104 -435 1398 2454 2601 2205 1337 934 372 -391
379609 -391 -149 957 1550 1368 296 -1236 -2071 -1830 -1286 -1226 -900 -348 -722 -20 1388 1901 1866 2130 1654
380189 1654 691 -401 -1041 -659 -198 -204 -1222 -1671 85 1829 2990 3141 2248 691 18 1692 3588
380708 3588 3630 2438 1299 1590 3638 4998 3914 1885 -300 -1217 -1213 -1884 -1997 -1072 -933 -93 690 393
381257C93p74r84r4L95L93L70J187J670J054o5p27j104r79o75r70j8Q0o16j26
381837a590M49O42q7j97L46P22j02j044j94J72Q59O31j38l4L95M74k52j92o82
382417A78o94N29K189K496J200l13j024j215o16M04N31l8j006j932j440Qk27o63
382966a633J03J152J352L64n80J90P44l03j413m54J107Q84o42m87Q10R96J71l43
383515B018k47n26k78rk77m24k23p44j014j38J89J78Q59M98L70k32n16j146k378
384095d040o96J043J187J147M78J02J067J752J365M33p24n86L60O36J20r63j443
384614A238j625p63J255J471N30l46n21K93O53k42l34P6L27o4q56j7Q91J94r72
385194A188j72O82k38p56r49p19L56P73L48k89n2o24j695m50J373J525L85K72
$$ plain form
381257 393 -381 -1365 -1459 -1064 -671 -301 886 2556 3610 3545 2818 1714 735 60 -910 -928 -848 -1464 -1590
381837 -1590 -1141 -499 -586 -783 -437 285 183 -861 -1055 -883 -24 607 469 435 830 1304 1052 860 178
382417 178 -516 13 2202 4698 5898 5585 4561 3346 2730 3134 3665 3627 2621 689 -751 -743 -970 -1633
382966 -1633 -1530 -378 974 1338 758 948 1692 1389 -24 -478 629 1513 871 384 1194 2190 2361 2018
383515 2018 1771 1245 967 958 681 257 34 -710 -1724 -1862 -1673 -1495 -636 -138 232 0 -516 -1662 -4040
384095 -4040 -4736 -3693 -2506 -1359 -881 -779 288 2040 3405 3838 3114 2528 2888 3524 3644 2681 1238
384614 1238 -387 -1150 105 1576 2106 1760 1239 1532 2185 1943 1609 1685 2012 1948 1092 1075 1966 2160 1188
385194 1188 1016 1698 1460 704 -245 -964 -608 165 513 224 172 -452 -2147 -2597 -1224 301 686 958
385743I58P54P63O87J040M83K1j173j892r73J39O31K07M05N31k95l64o50l12O00
386323A560J04j260l31N5l7J69J52P07K30L38m21k45K60Q89M47p7p46m13j91m34
386934G56k91o4q00j591j68L18q29q33Pn4K44Q00P87p81j227j20O38r36j663M31
387544e376J450J298J780O47r4J44m1N03K94o15j572k095j285L27O41L71L08o4
388093c379n26R39J449J107O2p53O84J667K285J416m81m05P68n4q00K82k87j545
388643B429j166K22N33K86j80J28J012R84q04j313j397j522l93N13J454J320N11
389161B617q5N3j085k034n48Q46P28J42l17n67P09Q28M02L89J003mj688j346M77
389741E20J133K82k01o44l59K27o05q45N70J593J367L66l15p26j74j81j502l33
$$ plain form
385743 958 1712 2475 3162 4202 4685 4706 3533 1641 668 807 1438 1645 2050 2581 2286 1922 1272 960 1560
386323 1560 1664 404 73 128 91 260 412 1119 1349 1687 1266 1021 1281 2170 2617 2540 1794 1381 1190 756
386934 756 465 401 -399 -1990 -2158 -1840 -2669 -3502 -3495 -3549 -3305 -2505 -1718 -2499 -3726 -3846 -3208 -4144 -5807 -5376
387544 -5376 -3926 -2628 -848 -201 -295 -151 -192 311 605 -10 -1582 -3677 -4962 -4635 -3994 -3623 -3315 -3379
388093 -3379 -3905 -2966 -1517 -410 -348 -1101 -417 1250 3535 4951 4470 4065 4833 4779 3979 4261 3974 2429
388643 2429 1263 1485 2018 2304 2124 2252 3264 4248 3444 2131 734 -788 -1181 -668 786 2106 2617
389161 2617 2532 2585 1500 -534 -1082 -236 492 634 317 -250 459 1287 1689 2078 3081 3077 1389 43 520
389741 520 1653 1935 1734 1090 731 958 353 -492 78 1671 3038 3404 3089 2363 2189 2008 506 173
390291A73M48j53j032r18K0l93j482j651n27J089K361K193L25j681k024n40M77
390809c315J174K500K746R53n38j416j257r7j57m4N91Q54K46J80q5O13j62q01
391359A985K47O07l74r25j26p39j830j705J21J410J806J56k030j733n65J13O48
391877b934O40k08o9J53n28j741j273L20J461R32o49j39P23O81o2P15M30o40L16
392457a872J017J395N06n51K75J164N98K81r39r49jK68m10L21R63Q17M47m2j139
393037B149j404l76q52L36L67N00O06m21q11O37J627Q03l40l06r31j229q65J57
393587c53M76Q79n00o88J73k75j321p46L37N94o4R0P15K35n79r65K07J464R80
394167F59J6N63J346j33j526j579q34J0K4l26j9j52j160j684J10J973O10o07O67
$$ plain form
390291 173 621 468 -564 -1482 -1462 -1855 -3337 -4988 -5515 -4426 -2065 128 453 -1228 -3252 -3792 -3315
390809 -3315 -2141 359 3105 4058 3520 2104 847 750 593 549 1140 1994 2240 2420 2335 2948 2786 1985
391359 1985 2232 2839 2465 1540 1414 675 -1155 -2860 -2739 -1329 477 633 -1397 -3130 -3695 -3582 -2934
391877 -2934 -2294 -2502 -2571 -2418 -2946 -4687 -5960 -5640 -4179 -3247 -3896 -4035 -3312 -2631 -2693 -1978 -1548 -2188 -1872
392457 -1872 -855 540 1046 495 770 1934 2532 2813 1874 925 924 1192 782 1103 2066 2883 3330 3288 2149
393037 2149 745 369 -483 -147 220 720 1326 905 94 731 2358 3161 2821 2515 1584 355 -510 -353
393587 -353 123 1002 502 -186 -13 -288 -1609 -2355 -2018 -1424 -1488 -1398 -683 -448 -1027 -1992 -1785 -321 659
394167 659 675 1238 2584 2451 925 -654 -1488 -1478 -1454 -1780 -1799 -1951 -3111 -4795 -4685 -2712 -2102 -2709 -2042
394746b042J252O48P06J30m11k11m26N54K24n63r48r74k90O0o6M96K309J671j266
395326H53k082q24K71m9P3Q6L8o48p37L12P56R21K44P69J102Q45N23m5K83P22
395937C413J081k20q42o79j253p59K95n6o12o10o36p5L31Q59M01K14Q38K88J224
396516C202J741r2o50q27n13k16K77L69o84q34K32R25J208J14k013j710j95M62
397066G96R94J423J078K98K89p73k884k555p76k86N74K25q86p30M51O32r46r15
397615c991m21j296K39J631J188N98k47k54P45Q24J587K961J519o05j645q95P92
398134B730J255k17j444j506k036j863J35J717J671N35R69P17q34j121k9K19L4
398653I32P60Q7P04N62n61j828k056o70O80J227J141R1r27q19j235j023L82K26
$$ plain form
394746 -2042 -790 -142 564 694 283 72 -354 200 424 -139 -1087 -2061 -2351 -2291 -2357 -1861 448 2119 853
395326 853 -1229 -2053 -1782 -1831 -1758 -1672 -1634 -2282 -3019 -2707 -1951 -1030 -786 -17 1085 1930 2453 2408 2691 3413
395937 3413 4494 4274 3432 2753 1500 741 1036 980 368 -242 -878 -953 -622 237 638 852 1690 1978 3202
396516 3202 4943 4851 4201 3374 2861 2645 2922 3291 2607 1773 2005 2930 4138 4252 2239 529 334 796
397066 796 1790 3213 4291 4589 4878 4105 1221 -1334 -2110 -2396 -1822 -1597 -2483 -3213 -2762 -2130 -3076 -3991
397615 -3991 -4412 -5708 -5469 -3838 -2650 -2052 -2299 -2553 -1808 -984 603 3564 5083 4478 2833 1938 2730
398134 2730 3985 3768 2324 818 -1218 -3081 -2946 -1229 442 977 1946 2663 1829 708 679 898 932
398653 932 1692 1779 2483 3045 2484 656 -1400 -2070 -1390 -163 978 1069 142 -677 -1912 -2935 -2553 -2327
399202b327j98n3K51M45j162j621k87J15R3L24J135K105J698o83j551n99n65n63
399751c443N67N74k96p30p02o54J23J931P29j045j113m83j30P73N56M20L05P23
400301a895J96m02J220K021J03q04q31k71J66N55J750J394j60J28L08l89r49q78
400850A262l22m98j29l31l63m56p88j299o10J131K385K346O18j135k450L38K561
401369B260K264O73l08m57k06j378j235n68n83j7k95p29p74Q0q7Q4R82J021n7
401949F70n75j7n00l80Q33P57n24n32l77r13m57l20m20M1K32K49P10J230M30m60
402559c23L54J438R91K7q74j808j705j189O67J557m88n66M61L99O34J012K030
403078B617Q34n98j465j232k40L03R85K17j48j190r36J117J611J61j133k196j355
$$ plain form
399202 -2327 -2525 -2578 -2327 -1882 -3044 -4665 -4952 -4837 -4744 -4420 -3285 -1180 518 -165 -1716 -2315 -2880 -3443
399751 -3443 -2876 -2302 -2598 -3328 -4030 -4684 -4561 -2630 -1901 -2946 -4059 -4542 -4672 -3899 -3343 -2923 -2618 -1895
400301 -1895 -1699 -2101 -881 1140 1243 439 -392 -663 -497 58 1808 3202 3042 3170 3478 3089 2140 1262
400850 1262 940 442 313 -18 -381 -837 -1625 -2924 -3534 -2403 -18 2328 2946 1811 -639 -301 2260
401369 2260 4524 5197 4889 4432 4226 2848 1613 1045 462 445 150 -579 -1353 -1273 -1360 -1276 -294 727 670
401949 670 95 78 -422 -802 31 788 264 -268 -645 -1558 -2015 -2335 -2755 -2714 -2482 -2233 -1523 -293 137 -323
402559 -323 31 1469 2460 2487 1613 -195 -1900 -3089 -2422 -865 -1353 -1919 -1458 -1059 -425 587 2617
403078 2617 3451 2853 1388 156 -84 219 1204 1421 1273 83 -853 264 1875 2036 903 -1293 -2648
403597b648K72Q32R07R0m24o11j192j166J21J785J708M86j025j389r69o08k81
404116d112L39Q91J405J144J042P54p51j91K31m04n02q01p19n37N04J49P26Q24
404665hL63m22j290n44L42Q25J281R76L53m61q00L29N4p9N98op3n37L06J341L72
405306B920j170j149o76J81m82j403K45K056J591j16k139j711l86K5K9M24Q95
405824h66J256K48o5R0N70ok76Q60J175k95j98M93N3k31j349j316p05J72M74m71
406435c87n92p42j097l16L83O34J466J561J775J105R4j095j159k01m64J8n7j288
406984c62l77R11K81l22O3O72O41O79Q70k27m21%P07P71N92n60k078j004R5L79
407594A310N95n3l34p20P21J358O51j282l050j874Q8R39M63K04k57k38J209J415
$$ plain form
403597 -2648 -2376 -1544 -637 -547 -971 -1582 -2774 -3940 -3819 -2034 -326 160 -865 -2254 -3223 -3831 -4112
404116 -4112 -3773 -2882 -1477 -333 709 1463 712 521 752 348 -154 -955 -1674 -2211 -1707 -1558 -832 -8
404665 -8 355 -67 -1357 -1901 -1559 -734 547 1523 1876 1415 615 944 998 919 1517 1511 1438 901 1207 2548 2920
405306 2920 1750 601 -75 106 -376 -1779 -1534 522 2113 1997 -142 -1853 -2239 -2214 -2185 -1761 -866
405824 -866 390 638 573 663 1233 1227 951 1811 2986 2691 2493 2986 3039 2808 1459 143 -562 -390 84 -387
406435 -387 -979 -1721 -2818 -3134 -2751 -2117 -651 910 2685 3790 3884 2789 1630 1429 965 983 926 -362
406984 -362 -739 172 453 131 194 866 1507 2186 3056 2829 2408 2408 3115 3886 4478 3918 1840 836 931 1310
407594 1310 1905 1852 1518 798 1519 2877 3528 2246 -804 -2678 -2590 -1651 -1188 -984 -1241 -1479 -270 1145
408144A145M20k01L18J286R16p1n69m35q98j240p23q1J405K114O59r82p93R4P75
408724C139N77k44o25K7J067J36m68j771j408j006n02L29O3l47o97K99J795J178
409273A542q21k038j883L97K016R85l41k73j88j166j367q3Q09Q28M39L9m38r64
409823b507n82N3j12M34r6n89J47R3l81j82L2K2l40n52r00j49J825K677l39j783
410433c229m4O35l86j205p54J765K137P32J329R79j19l24L05J19q69o82k82j50
410982d3j010l72P26R41j9l71L21O28p53j848k092j370M51R26l43J213J500j21
411531a636N22J138N28K69J42k20K84M76k65o3J9Q0K31P72J334M47k83j206k146
412111D23k296o39K42M8P23O75p81j577n98R97L00k44n52j184m80J011O59q86
$$ plain form
408144 1145 1565 1364 1682 2968 3884 3813 3244 2809 1911 671 -52 -133 1272 3386 4045 3063 2270 2364 3139
408724 3139 3716 3472 2847 2874 3941 4077 3609 1838 430 -576 -1078 -749 -686 -1033 -1730 -1431 364 1542
409273 1542 721 -1317 -3200 -2803 -787 198 -143 -416 -604 -1770 -3137 -3220 -2411 -1583 -1144 -1105 -1543 -2507
409823 -2507 -3089 -3036 -3148 -2714 -2810 -3399 -3252 -3159 -3540 -3722 -3690 -3668 -4008 -4560 -5460 -5609 -3784 -1107 -1446 -3229
410433 -3229 -3273 -2638 -3024 -4229 -4983 -3218 -1081 -349 980 1959 1840 1516 1821 1940 1071 389 107 -43
410982 -43 -1053 -1425 -699 242 223 -148 173 801 48 -1800 -3892 -5262 -4811 -3885 -4228 -3015 -1515 -1636
411531 -1636 -1114 24 552 821 963 743 1027 1503 1238 1175 1194 1274 1505 2277 3611 4058 3775 2569 423
412111 423 -1873 -2512 -2270 -2222 -1499 -824 -1605 -3182 -3780 -2783 -2483 -2727 -3279 -4463 -4943 -3932 -3273 -4159
412661d159k339n72Q53J616K337J711K31l75J33j25mO33R11O84J082M78n67N14
413210C042K92n09k36o98Q68K187J236m65j250k089k565k113j097M25J243J189
413698e40M20r73j391p2P02J96L29k1P14J979K075J654J91k012j135J62L39j01
414248B516j29k22j253j724o81J22J917J001q06o41J065N60L28k54n29o19j214
414767e63m31O00J801K159J325J99k06k373k259j141j498j022J171K886K385R72
415255D005L73J86K99p12j733q04O5N68R4M21O36r50j105o15P85J91q15o4J3P8
415865I16N60J077M94r15j256j047q5J497N21j46o20j647n67R39L64j41o19j177
416414a852r0M1L17R27J257M35o00j343j431k89L53J225J520j49j730p97m99J32
$$ plain form
412661 -4159 -6498 -7070 -6217 -4601 -2264 -553 -322 -697 -564 -689 -693 -60 851 1535 2617 3095 2528 3042
413210 3042 3334 2825 2589 1891 2759 4946 6182 5717 4467 2378 -187 -2300 -3397 -2972 -1729 -540
413698 -540 -120 -1093 -2484 -2556 -1854 -1658 -1329 -1350 -636 1343 3418 5072 5263 3251 2116 2278 2617 2516
414248 2516 2387 2165 912 -812 -1493 -1371 546 1547 741 100 1165 1725 2053 1799 1270 651 -563
414767 -563 -994 -394 1407 3566 4891 5090 4884 2511 252 -889 -2387 -3409 -2238 648 3033 4005
415255 4005 4378 4564 4863 4151 2418 1614 1679 2247 2341 2762 3398 2448 1343 728 1513 1704 889 825 838 916
415865 916 1476 2553 3047 2132 876 -171 -256 1241 1762 1616 996 -651 -1218 -279 85 -56 -675 -1852
416414 -1852 -1942 -1901 -1584 -657 600 1035 435 -908 -2339 -2628 -2275 -1050 470 321 -1409 -2206 -2705 -2573
416964b573Q11O92N06k77j164o74Q33L77R3k44p31n94J84M33J159J988J342l12
417513A849j385j224n69n53j37J83K08K64M02j67m96k79J34O58J042J032o70m80
418062a88P13Q82P54M12K17n4J62J98R0J61nm69j67L8m44L69O96l59K36K93j549
418703A986j994r66L09J388P55P75J54M9j09J26q27j077Q4Q02j07j632r50J05
419253a129J319M95n31J36k43l33n61j92J195J266R32N06P07J68q85j006L05L86
419802B535K61K97o74m21J036L81j187j613k80J091J924m5q35k15j036j775o56
420321a212O8k9K71Q46J386J140L31j039j879k378j152Q64K176K576J570J109
420809D648J118j45j223j124r57j022p92J08K20j132k224n08P2M96J931J179L4
$$ plain form
416964 -2573 -1762 -1070 -564 -841 -2005 -2679 -1846 -1469 -1376 -1620 -2351 -2945 -2761 -2328 -1169 819 2161 1849
417513 1849 464 -760 -1329 -1882 -2019 -1836 -1628 -1364 -962 -1129 -1625 -1904 -1770 -1112 -70 962 292 -188
418062 -188 525 1407 2161 2573 2790 2736 2898 3096 3186 3347 3342 2873 2706 2744 2300 2669 3365 3006 3242 3535 1986
418703 1986 -8 -974 -665 723 1478 2253 2407 2456 2347 2473 1646 569 653 1455 1348 -284 -1234 -1129
419253 -1129 190 685 154 290 47 -286 -847 -1039 156 1422 2354 2860 3567 3735 2850 1844 2149 2535
419802 2535 2796 3093 2419 1998 3034 3415 2228 615 335 1426 3350 3305 2470 2255 1219 -556 -1212
420321 -1212 -1144 -1173 -902 -56 1330 2470 2801 1762 -117 -2495 -3647 -2783 -607 1969 3539 4648
420809 4648 5766 5621 4398 3274 2317 1295 503 611 831 -301 -2525 -3033 -2961 -2465 -534 645 679
421328F79l65J245J628n70j108q82K48M79k13J09J34L10N86J025J173L68r63j521
421877B362k50j38q63j151o95o59j358o61L0N17N17l46r22j82J203J760J015O12
422426G91l68q21j17o7L65R02J312J106m67q42p96L40N64Rp5R50P27P02J90p97
423037C608j630j104K16P26o33j908o39J296J291K96l88p66j87j16j27j39q8m05
423586f97q41k85J191J795J168p61j695p58L19J87n18j38n22N25J272Q4m11J294
424136A209J746k80j927j703j435j343M54P20J80K58J371J318J65j10K0J16n0
424655G09L89J44j022m92N03O7j434j262J5J33K40R44K43l57m08K21R9k30O17
425234h81J62n83k97Q74J356m21r57r22j172p41P02J443O05j12NM45J354k72j232
$$ plain form
421328 679 314 1559 3187 2617 1509 627 875 1354 1141 1250 1384 1694 2280 3305 4478 4846 3883 2362
421877 2362 2112 1974 1111 -40 -735 -1394 -2752 -3413 -3383 -2866 -2349 -2695 -3617 -3799 -2596 -836 179 791
422426 791 423 -398 -515 -582 -217 685 1997 3103 2636 1794 998 1338 1902 1911 1836 2786 3513 4215 4405 3608
423037 3608 1978 874 1090 1816 1183 -725 -1364 -68 1223 1519 1131 365 178 62 -65 -204 -292 -697
423586 -697 -1538 -1823 -632 1163 2331 1570 -125 -883 -564 -377 -895 -1033 -1555 -1030 242 326 -85 1209
424136 1209 2955 2675 748 -955 -2390 -3733 -3279 -2559 -2379 -2121 -750 568 733 623 643 759 709
424655 709 1098 1242 220 -272 231 298 -1136 -2398 -2383 -2250 -2010 -1066 -823 -1180 -1588 -1367 -1268 -1498 -881
425234 -881 -719 -1302 -1599 -725 631 210 -747 -1669 -2841 -3582 -2880 -1437 -832 -944 -939 -494 860 588 -644
425814f44n82o21j21L79R52J1o73M42L09p91M08O45K61j227r41J193J399R52J633
426394B984K483J649P68J90o27j738k763k663o81O30m88p55O21N18j01o66j798
426913b437j513n74k53K002K245P13P46M43r46j576j039p43M76J994J177o47j048
427431i80j62L78P36J609R19j589j977l21J46O96K4m94n53K47L63J75P88N21M93
428012A019M88m66k92J071J691J383J473J162R12j647l856l351j661j088j42O0
428500c244O05J147L38O70N70M09J48L33o72k367j541J127J984J174J321J743
428988C745o94j407p27r5J095J861K95j327j660j031o15k29R57P30J17O17R19
429507B551O97L15o36j498r59j97R7L59Q64J277J38q76M98J387J148Q56K43o22
$$ plain form
425814 -644 -1226 -1847 -1968 -1589 -637 -626 -1299 -857 -548 -1339 -931 -286 -25 -1252 -2193 -1000 399 1351 2984
426394 2984 5467 7116 7884 8074 7447 5709 2946 283 -398 232 -256 -1011 -390 128 27 -639 -2437
426913 -2437 -3950 -4524 -4777 -2775 -530 183 929 1372 426 -1150 -2189 -2932 -2456 -462 715 68 -980
427431 -980 -1142 -764 -28 1581 2500 911 -1066 -1387 -1241 -545 -521 -1015 -1568 -1321 -958 -783 5 526 1019
428012 1019 1507 1041 749 1820 3511 4894 6367 7529 8441 6794 2938 -413 -2074 -3162 -3304 -3244
428500 -3244 -2639 -1492 -1154 -484 86 495 643 976 304 -2063 -3604 -2477 -493 681 2002 3745
428988 3745 3051 1644 917 822 1917 3778 4073 2746 1086 55 -560 -789 168 898 1015 1632 2551
429507 2551 3248 3563 2927 1429 470 273 370 729 1593 2870 3008 2132 2630 4017 5165 6021 6264 5642
430056E642k458l133j473k09J97k14m01K63J154j11j006o77L80n6l35P66J335
430575c36J5j199j681o60R69J106L24L86l48r20n55M27J149R55p5m83p55r97l5
431155b713M27R53J082P2j79N63M3p47r25p5M81K7l48o94o14J177K945Q09q00
431735A484j278j401K3M52nj216j437M20J350n23l71N77N77R4M97J87R4k12j333
432314b021j222P29J829N27j521j013J35k08j272j286O64J828N09R3O84R62J136
432834E53Mj290j512j253q13J3M92J215J348q0o48O35L09q06j603m74L25M9L56
433413c180K66n31M85P66l85M46J168M66R3m14o94M1R88j46j266j823j084N76
433963d228N71pm98Q07J638J471K2k215k513l183j294O70K408J937K052K497Q23
$$ plain form
430056 5642 3184 51 -1422 -1631 -1434 -1648 -2049 -1786 -632 -743 -1749 -2426 -2046 -2102 -2437 -1671 -336
430575 -336 -321 -1520 -3201 -3861 -2892 -1786 -1462 -1076 -1424 -2344 -2899 -2472 -1323 -368 -443 -926 -1681 -2678 -2713
431155 -2713 -2286 -1333 -251 -179 -358 205 248 -499 -1424 -1499 -1018 -991 -1339 -2033 -2647 -1470 1475 2284 1484
431735 1484 206 -1195 -1172 -720 -725 -1941 -3378 -2958 -1608 -2131 -2502 -1925 -1348 -1254 -757 -570 -476 -688 -2021
432314 -2021 -3243 -2514 -685 -158 -1679 -2692 -2557 -2765 -4037 -5323 -4659 -2831 -2322 -2229 -1545 -583 553
432834 553 557 -733 -2245 -3498 -4311 -4298 -3806 -2591 -1243 -1323 -1971 -1336 -1027 -1833 -3436 -3910 -3585 -3536 -3180
433413 -3180 -2914 -3445 -2960 -2194 -2579 -2133 -965 -499 -406 -820 -1514 -1473 -485 -631 -1897 -3720 -4804 -4228
433963 -4228 -3657 -3664 -4162 -3355 -1717 -246 -224 -2439 -4952 -8135 -9429 -8759 -6351 -4414 -2362 135 958
434481I58K73M83N65L76k77j597k155K95J463J650J428O20j537k124p73M89j44
435000gn32O42K038J846M14j492j255P03O71o11p20ll00k16l67p73k92l97j47
435580g98k6L57J068n13j513r84p16n43K6L2K4n01l87M51M61p29r16L26J354P24
436190b803L50k81M0J394J977J359L17O38P83o48n12M20N15R2O82K79j921j826
436740H55j074j9L23J267J564M23l33j033j078n49R77J167N88J563J459L78K38
437258F716m0j91J493O75j934k602q08j40m1m27o58n00n85m06P43J305J164m4
437808C720O89Q00n72j885j717p95m98l81J92N98Q32O88K3q15j05J357O68j9K6
438388B806o22r7o24j724j429j797j18J517Q78o90j045r84J35J355J728J181O55
$$ plain form
434481 958 1231 1714 2279 2655 2378 781 -1374 -1079 384 2034 3462 4082 2545 421 -352 137 -7
435000 -7 -539 103 2141 3987 4401 2909 1654 2357 3028 2417 1697 1694 1394 1178 811 38 -254 -651 -798
435580 -798 -824 -467 601 88 -1425 -2409 -3125 -3668 -3642 -3610 -3586 -4087 -4474 -4023 -3562 -4291 -5207 -4881 -3527 -2803
436190 -2803 -2453 -2734 -2694 -1300 677 2036 2353 2991 3774 3126 2614 3034 3549 3641 4323 4602 2681 855
436740 855 -219 -238 85 1352 2916 3339 3006 1973 895 346 1323 2490 3078 4641 6100 6478 6716
437258 6716 6676 6485 7978 8653 6719 4117 3309 3169 3128 2701 2043 1543 958 552 1295 2600 3764 3720
437808 3720 4409 5209 4637 2752 1035 240 -258 -639 -447 151 983 1671 1694 879 774 2131 2799 2780 2806
438388 2806 2184 2087 1463 -261 -1690 -3487 -3605 -2088 -1210 -1900 -2945 -3929 -3794 -2439 -711 470 1125
438907A125R6J42K95L48l43j660j303m49J025P25j020j387o16L03Q92N95Q85J465
439456A118J347J6q26j193l60m61RQ45R59J92j73l2p18r11m79o57j816j181R91
440036c330K200Q11R2N20J102Q85l67j242k95K292L039Q9k400k858k383q23N81
440555b087j04k37j11q2R58J274J463J634N91m44j265q21J02Lq27R8L66N99j23
441134I87j134r22k08M87q05j432l52P79n85j639K21K162J806n06p44j058j156
441653d099l63L33j60K85K42Q35km62J59m89j68M78O11J147J509N1j492j342m0
442233b967K55j296j039K7K83J245J139J220J241J493M02r85j315j483q59k1n
442752b665o27j148n21j35M28R5r23N31J789M58j354j520P05Q33L59J483J568
$$ plain form
438907 1125 1221 1363 1658 2006 1663 3 -1300 -1749 -724 1 -1019 -2406 -3022 -2719 -1827 -1232 -347 1118
439456 1118 2465 2481 1655 462 102 -359 -350 495 1454 1646 1473 1441 723 -188 -667 -1324 -3140 -4321 -3330
440036 -3330 -1130 -319 -227 293 1395 2280 1913 671 376 2668 5707 5796 3396 538 -1845 -2668 -2087
440555 -2087 -2191 -2428 -2539 -2621 -1663 -389 1074 2708 3299 2855 1590 769 871 874 47 145 511 1110 987
441134 987 -147 -1069 -1277 -790 -1595 -3027 -3379 -2600 -3185 -4824 -4603 -2441 -635 -1141 -1885 -2943 -4099
441653 -4099 -4462 -4129 -4289 -4004 -3762 -2927 -2929 -3391 -3232 -3721 -3889 -3411 -2800 -1653 -144 -93 -1585 -2927 -2967
442233 -2967 -2712 -4008 -5047 -5020 -4737 -3492 -2353 -1133 108 1601 2003 1018 -297 -1780 -2639 -2660 -2665
442752 -2665 -3292 -4440 -4961 -5096 -4668 -4573 -5496 -4965 -3176 -2718 -4072 -5592 -4887 -4054 -3695 -2212 -644
443271f44k39p30N14M66p48j404q36n5j19J65Q76J15j482j411K14J464J701J101
443820a052O99J88n39o30o75p30k75O64O65j39Q9l35p80O3J95j75K77k64p83l28
444430c865P8l45o21M24J701K298K097J022p39j976k600j683n73R74J937J446
444919d25k36j075o73L8N40L57p17m27J029J140j10m98L59J018N54n96p07j77
445468f06O85O58q97m68R43J53n71l75K0q99k477k088P98J164L66J612K345J291
446017A654q0j477k587r76J639K021J000P96Q20R21P06r58j846r29J191K384J041
446536E320K59O8p13j775j950r76n44j038p14r88m07n1J10R25Q65M21N65K67o80
447116a036O74J923J114j156k341k153o58J293K343P93o82m68L12N77j62q78M30
$$ plain form
443271 -644 -883 -1613 -1099 -633 -1381 -2785 -3621 -3676 -3795 -3630 -2754 -2639 -4121 -5532 -5318 -3854 -2153 -1052
443820 -1052 -353 -165 -704 -1334 -2009 -2739 -3014 -2350 -1685 -1824 -1735 -2070 -2850 -2787 -2592 -2767 -2490 -2754 -3537 -3865
444430 -3865 -3787 -4132 -4753 -4329 -2628 -330 1767 2789 2050 74 -2526 -4209 -4782 -3808 -1871 -425
444919 -425 -661 -1736 -2409 -2371 -1831 -1474 -2191 -2618 -1589 -449 -559 -1057 -698 320 874 278 -429 -606
445468 -606 79 737 -160 -628 315 468 -103 -478 -458 -1357 -3834 -5922 -5124 -3960 -3594 -1982 363 1654
446017 1654 1574 97 -2490 -3466 -1827 194 1194 1990 2810 3731 4437 3479 1633 704 1895 4279 5320
446536 5320 5579 5647 4934 3159 1209 233 -311 -1349 -2063 -3051 -3458 -3509 -3399 -2474 -1609 -1188 -623 -356 -1036
447116 -1036 -362 1561 2675 1519 -822 -2975 -3633 -2340 3 796 114 -354 -42 535 373 -505 -75
447635g5J38j456j389p97K29Q96Q95Q92J492Q92n5K48j135j878j187J37J007M06
448184g40j01j45l48k60L90N01q41o46N51J617J263k55k53q22j991k170r30K47
448734d933J97R93J076J586R75P92J14p58p47Q70N65p08o17P84J258j38j230j667
449283a588p54J300J921N33j097j05k11n43m87o38J28M67O08K23Q11M12j52m04
449832D24q20j080o00m54k50o00j207j68O07J024J041j01j41J655J328K46J71
450351A075P37K35k96Q38K074J064o07j321k214k620q24J451K478K061mj063p96
450870B268l23N70K98K18m19j103m60q83r24n14J1L27M7L16M52k8l26l35K22j96
451480g82Q1J46k98N1P53O3n50J30J56l73k09N53P08N29N19N56l2K6O0r13k57
$$ plain form
447635 -75 63 -1393 -2782 -3579 -3350 -2454 -1559 -667 825 1717 1662 1910 775 -1103 -2290 -2153 -1146 -740
448184 -740 -841 -986 -1334 -1594 -1204 -703 -1544 -2190 -1639 -22 1241 986 733 -89 -2080 -4250 -5180 -4933
448734 -4933 -4736 -3743 -2667 -1081 -106 686 800 42 -705 165 730 22 -595 189 1447 1309 79 -1588
449283 -1588 -2342 -1042 879 1412 315 210 -1 -544 -1031 -1669 -1541 -1074 -466 -243 568 980 828 424
449832 424 -396 -1476 -2076 -2530 -2780 -3380 -4587 -4755 -4148 -3124 -2083 -2184 -2325 -670 658 904 1075
450351 1075 1812 2047 1751 2589 4663 5727 5120 3799 1585 -1035 -1859 -408 2070 4131 4127 3064 2268
450870 2268 1945 2515 2813 3031 2612 1509 1049 166 -758 -1272 -1261 -934 -887 -571 -119 -147 -473 -808 -586 -782
451480 -782 -701 -555 -853 -802 -49 14 -536 -406 -250 -623 -832 -279 429 958 1477 2033 2001 2027 2087 1174 917
452121I17O35O57K14j66r86m1J529O66k42J26L20k42n89j047m43n56p69M50Nr45
452732e07r88m72N36nJ68Q9n92o46k51n00p83lM65N81K44m3O52J959L04j196p14
453372a702N82Nj706j360P7L07J095J546p3j623r64j164L69L078L040R53r55l52
453922A153J615K743J410J00p57n26k43p20q91q73n54R07J746Q43n14j036j036
454440C367j619j312m27o75j519j701r4J482J628O31L47O44R73K071R22j113r45
454959B660P8l10j940k766j063K29J133J397J493O33L53N84r0j291j384m72j06
455478h62q3K64K31L81Q6m16k61N63M05P4O19K19M7J54K92J275J09j556j381m16
456088b56j98n27p29p49l41K9O46J640J992M05j605l025q31J095K34J532K290
$$ plain form
452121 917 1552 2209 2423 2257 1271 1230 2759 3425 3183 3309 3629 3387 2798 1751 1308 752 -17 433 438 -507
452732 -507 -1495 -1967 -1431 -1436 -1268 -1179 -1771 -2417 -2668 -3168 -3951 -3954 -3489 -2908 -2664 -2707 -2055 -96 208 -988 -1702
453372 -1702 -1120 -1115 -2821 -4181 -4104 -3797 -2702 -1156 -1229 -2852 -3816 -4980 -4611 -1533 1507 2460 1505 1153
453922 1153 2768 5511 6921 7021 6264 5738 5495 4775 3884 3011 2457 3364 5110 5953 5439 4403 3367
454440 3367 1748 436 9 -666 -2185 -3886 -3980 -2498 -870 -239 108 752 1725 3796 4718 3605 2660
454959 2660 2738 2428 488 -2278 -3341 -3112 -1979 -582 911 1544 1897 2481 2391 1100 -284 -756 -862
455478 -862 -945 -681 -450 -69 17 -399 -660 -97 308 382 1001 1220 1267 1421 1713 2988 3097 1541 160 -256
456088 -256 -454 -981 -1710 -2459 -2800 -2771 -2125 -485 1507 1912 307 -2718 -3549 -2454 -2220 -688 1602
456607A602M2k017j384K52R29J047K9p07m19j39J15l02j068q31N69J252J078Q29
457157H77K2j007j557j171K51K78L80K41m42M95J418m00j933j375n88m91M83P15
457706c804K12J206J850J012M05R62L2j189p39K57r8l5p28j493j186K3Q84J017
458255a412J256Q42O37J93n77k377k251l57L74nj28K12P37J562J819P99n84r34
458805a94j301j902j754r55Q43J726J147K13n58n53k11K22m13m13N64R55J041
459323a543N84L1N36K52J86L12M38k99j528p78K34O94R50K82o03j713j364l38
459873c667m27m87M17J247J834J127r10j327O02J573O91k52q81j333j109J76Q75
460392a851J8j048o0J239K075K025m9j184L03m41j592j534j001n07Q50J044q39
$$ plain form
456607 1602 1644 -373 -1757 -1505 -576 471 500 -207 -626 -765 -650 -952 -2020 -2851 -2282 -1030 48 877
457157 877 899 -108 -1665 -2836 -2585 -2307 -1927 -1686 -2128 -1633 -215 -615 -2548 -3923 -4511 -5002 -4519 -3804
457706 -3804 -3592 -2386 -536 476 881 1843 1875 686 -53 204 106 71 -657 -2150 -3336 -3313 -2429 -1412
458255 -1412 -156 686 1323 1516 939 -1438 -3689 -4046 -3672 -3677 -3805 -3593 -2856 -1294 525 1324 740 -194
458805 -194 -1495 -3397 -5151 -6106 -5263 -3537 -2390 -2177 -2735 -3288 -3499 -3277 -3690 -4103 -3539 -2584 -1543
459323 -1543 -959 -928 -392 -140 46 358 796 497 -1031 -1809 -1575 -881 69 351 -252 -1965 -3329 -3667
459873 -3667 -4094 -4581 -4164 -2917 -1083 44 -866 -2193 -1591 -18 673 421 -460 -1793 -2902 -2726 -1851
460392 -1851 -1833 -2881 -2941 -1702 373 2398 2349 1165 1468 1027 -565 -2099 -3100 -3607 -2757 -1713 -2552
460910b552l27J410N47O2J652J111K5m73r92j701j442j43Q05K8J107J685R59n45
461460A216p83k89o76l84q55o23J083P90p76o98L63J85L56J993J706n5j113j591
462009a51r79N66P27m63QN23N34N7l72k061k682j687J210L481K646J143j80n4
462558B266q1o37j237o59o42q03j192o48M6N63J361K083N40m61M22Qq90j220m36
463138a617J7n07o20J30J116J522R98N06n51j154p61JL46J152J507J259K26k98
463688C272o31j508j462J8K66k10n09o38m30n43p26o36l19j9j82J41l53r10l07
464267e686J159R88R76J358Q59p22j377k10O48j95j062M4J388R84K45r91j387
464786b981p43L42J410L56k81N77O45o67j536j357j238j078K66Q40P6K69J580
$$ plain form
460910 -2552 -2879 -1469 -922 -860 792 1903 1928 1455 463 -1238 -2680 -2823 -2018 -1990 -883 802 1761 1216
461460 1216 433 144 -532 -916 -1771 -2394 -1311 -521 -1297 -1995 -1632 -1447 -1091 902 2608 2553 1440 -151
462009 -151 -1130 -564 163 -300 -292 231 765 822 450 -1611 -4293 -5980 -4770 -1289 1357 2500 2320 2266
462558 2266 2185 1548 311 -348 -990 -1793 -2985 -3633 -3587 -3024 -1663 420 960 499 921 929 39 -1181 -1617
463138 -1617 -1600 -2107 -2727 -2597 -1481 41 1039 1545 994 -160 -921 -920 -574 578 2085 3344 3570 3272
463688 3272 2641 1133 -329 -311 -45 -255 -764 -1402 -1832 -2375 -3101 -3737 -4056 -4075 -4257 -4116 -4469 -5379 -5686
464267 -5686 -4527 -3539 -2563 -1205 -346 -1068 -2445 -2655 -2007 -2202 -3264 -3220 -1832 -848 -603 -1594 -2981
464786 -2981 -3724 -3382 -1972 -1616 -1897 -1320 -675 -1342 -2878 -4235 -5473 -6551 -6285 -5445 -5369 -5100 -3520
465305c520J736Q28P14M69r6j89k4O8J1m3m00L89M65M41K47o5j024q29M7J313
465915E38J334J399O96j057j472j781m34K18J10L51n89r27q5J602J857l5j661
466434F4q08L56M44L10p9m5R62K166K959K36j455n57j017j085r28r14l16J19P73
467014A185q2q43O36Q46p08j011K94L65J49l1n93j11K05o35j454o76nL29R70O91
467625d79l47q38m83Q0K67k96j084K11J722O93j355j440q17rJ099J973J18k066
468174c051j422n70j42O48M17J296J505M23M83p30j901j30K441K955J871N43j09
468693D527J21n50m88n76j044m53l41j335r21j166j554j079m02R70J059J258J199
469211g75m00j106o56j147j184O69L73m20q9O13M76K79J915J604J58P98J991Q43
$$ plain form
465305 -3520 -1784 -956 -242 227 131 -58 -82 -14 -3 -46 -446 -57 408 849 1096 1031 7 -822 -775 538
465915 538 1872 3271 3967 2910 1438 -343 -777 -559 -449 -98 -687 -1614 -1699 -97 1760 1725 64
466434 64 -744 -388 56 366 287 242 1204 3370 6329 6565 5110 4553 3536 2451 1523 609 293 412 1185
467014 1185 1103 260 896 1742 1034 23 317 682 831 800 207 96 301 -334 -1788 -2464 -2469 -2140 -1170 -479
467625 -479 -826 -1664 -2147 -2067 -1800 -2096 -3180 -2969 -1247 -554 -1909 -3349 -4166 -4175 -3076 -1103 -985 -3051
468174 -3051 -4473 -5043 -5185 -4537 -4120 -2824 -1319 -896 -413 -1143 -3044 -3174 -733 2222 4093 4636 4527
468693 4527 4648 4098 3610 3034 1990 1537 1196 -139 -1060 -2226 -3780 -4859 -5261 -4291 -3232 -1974 -775
469211 -775 -1175 -2281 -2937 -4084 -5268 -4599 -4226 -4646 -4735 -4122 -3646 -3367 -1452 152 310 1108 3099 3942
469761C942m4r58r00o40P32P04q64j142p57q25j360j512n06J264R98r57k86L34
470310b777j48l67K89L17l13Q25J297J166L76J148J944J569R56p27j542r72j713
470829A328k684j997L27J869J052o95j28J125J743J538k16r10k87j689k279j600
471317c503J6K39J078J867J257j55o36j184j413o53M29P20O2k57M4K91m18m17
471866b633j4q46j475m95R14Q70M46J199J932Q02L25R94M71J42J589J402R56M04
472416F983r00k098j418m40r32j149k71j9P88N03J001K07k077j972p48n52j211
472935d305l46N15J026J845R18r62j51M15k2j317o92R31R45j08m34l41j027o56
473484c766kM75j46K5J189N16o8M10J58L53k3j058j243j2J142M37j643k103r71
$$ plain form
469761 3942 3898 2940 2040 1400 2132 2836 1972 830 73 -752 -2112 -3624 -4130 -2866 -1868 -2825 -3111 -2777
470310 -2777 -2925 -3292 -3003 -2686 -2999 -2174 -877 289 665 1813 3757 5326 6282 5555 4013 3041 1328
470829 1328 -1356 -3353 -3026 -1157 -105 -800 -928 197 1940 3478 3262 2352 2065 376 -1903 -3503
471317 -3503 -3487 -3248 -2170 -303 954 799 163 -1021 -2434 -3087 -2658 -1938 -1876 -2133 -2089 -1798 -2216 -2633
471866 -2633 -2647 -3493 -4968 -5463 -4549 -3679 -3233 -2034 -102 700 1025 2019 2490 2632 4221 5623 6579 6983
472416 6983 6083 3985 2567 2127 1195 46 -225 -244 544 1047 2048 2255 178 -1794 -2542 -3094 -4305
472935 -4305 -4651 -4136 -3110 -1265 -347 -1309 -1460 -1045 -1067 -2384 -3076 -2145 -1200 -1308 -1742 -2083 -3110 -3766
473484 -3766 -3768 -3293 -3439 -3414 -2225 -1709 -1777 -1367 -1209 -856 -879 -1937 -3180 -3192 -2050 -1613 -3256 -5359 -6330
474064f330l55O63K203J644J402J875J58p49m7l86m48j333j423k88l95m92o11
474583d912q14N01J00o3R74R98k20M6Q75M17N47Q14p27r65r59j157l85O2J468
475162c400J092m71n07l67k92R45J420P09n30j45j86l44r85j390K35P91o58p48
475712d831n9J69O14J343J150L57P8j19M1j88j98j81J118O83p60j996j342M09
476261c712J479K855J990m27j342q43o23p66m01L8L49P6P39J763O04r3L02k7o52
476841A309o83L36m33j544j329o57J97N50R89J441P95o8J80n33k311k491j960
477360f212Q67K011J093N7m19O35J645K545J506n73j242q62j319j212q29r90j086
477879d385m91J408J162M86M33J032J058L23K15k36l59o83k94J254J804O95L95
$$ plain form
474064 -6330 -6685 -6022 -3819 -2175 -773 1102 1260 511 464 78 -370 -1703 -3126 -3414 -3809 -4301 -4912
474583 -4912 -5726 -5225 -5125 -5188 -4214 -3216 -3436 -3390 -2515 -2098 -1551 -737 -1464 -2429 -3388 -4545 -4930 -4868 -3400
475162 -3400 -2308 -2779 -3286 -3653 -3945 -3000 -1580 -871 -1401 -1546 -1732 -2076 -3061 -4451 -4216 -3425 -4083 -4831
475712 -4831 -4890 -4721 -4107 -2764 -1614 -1257 -1179 -1298 -1257 -1445 -1643 -1824 -706 -23 -783 -2779 -4121 -3712
476261 -3712 -2233 622 2612 2185 843 0 -623 -1389 -1790 -1752 -1403 -1327 -588 1175 1779 1686 1988 1961 1309
476841 1309 626 962 529 -1015 -2344 -3001 -2804 -2254 -1265 176 971 903 1083 550 -1761 -4252 -6212
477360 -6212 -5345 -3334 -2241 -2184 -2603 -1968 -323 2222 3728 3155 1913 1051 -268 -1480 -2309 -3299 -4385
477879 -4385 -4876 -3468 -2306 -1820 -1387 -355 703 1026 1241 1005 646 -37 -331 923 2727 3422 3817
478398C817k14o26o97r82m56m95r44p75N73J219Q14k75j381n20M95K42J224K42
478947A261n90L98L45o15p49m02r93j198O03J274J151j031k834j988J426M006
479435F4K911J350N93N54M63j085j632j585j005n22P66J087n1J50n81p6J638Q52
479984C891n92p11n55j050j49Pl44L41K15J076J996J819O37r92j021n58j013j233
480534A764r10j309r49m15L36p7n50j03l63o65N79K216J921O56J035J696J051
481052E913K48q14r60n49j139q21j10Q14J92p55K88N92kj40n22l61r7o99J06j35
481663A049p13j01O73P85P07J065J314J427J591J291J448K584M226M486M177N004
482151C1013O965R802J4929K3615L7745O1893R7540J33287J55054J57053J32289
$$ plain form
478398 3817 3603 2977 2280 1298 842 347 -597 -1372 -799 420 1234 959 -422 -942 -447 -205 1019 1261
478947 1261 671 1069 1414 799 50 -352 -1345 -2543 -1940 -666 485 -546 -3380 -5368 -3942 64
479435 64 2975 4325 4918 5472 5935 4850 3218 1633 628 106 872 1959 1908 2058 1477 1401 3039 3891
479984 3891 3299 2588 2033 983 834 841 497 838 1053 2129 4125 5944 6581 5589 4568 4010 2997 1764
480534 1764 854 -455 -1404 -1819 -1483 -1560 -2110 -2213 -2576 -3241 -2662 -446 1475 2131 3166 4862 5913
481052 5913 6161 5347 4387 3838 2699 1878 1768 2582 2774 2019 2307 2899 2897 2757 2235 1874 1777 1078 1184 1049
481663 1049 336 235 908 1693 2400 3465 4779 6206 7797 9088 10536 13120 17346 21832 26009 31013
482151 31013 37978 47780 62709 86324 124069 185962 283502 416789 571843 728896 861185
482487H61185P4589O94n6826r0888j07133j02743q1695o1241n0484m4932m1595
482823B98931l7473l2911k8037k4835k1753j9510j8018j5133j0025o163n489n066
483189G4518m348l760l285k225j562K80M723R300J5055K4855M2631P0734J07752
483586C34668J41089J57845J52091J17839N3084j7537o9744j00126j08570r6379
483891E64260p4802n8135m8718m3219l9894l5730l0860k8234k5810k1748j7754
484227A39356j6369j3384r685p745o636o091n726m188j972p04K134N877J1042
484623H5909J7423K6962M0527O0668Q9668J22794J45939J51410J35507R0669K3095
484959I90571m0391q3185j07093j11933r5863p3516n6857m8000m4324m1328l6653
$$ plain form
482487 861185 935774 936468 879642 788754 681621 578878 497183 435942 385458 340526 298931
482823 298931 261458 228547 200510 175675 153922 134412 116394 101261 91236 85073 79584 74518
483189 74518 70170 66410 63125 60900 59338 59618 64341 73641 88696 113551 156182 226916 334668
483586 334668 475757 633602 785693 903532 956616 939079 869335 769209 660639 564260
483891 564260 489458 431323 382605 339386 299492 263762 232902 204668 178858 157110 139356
484227 139356 122987 109603 99918 92173 85537 79446 73720 69532 67560 66856 68990 74867 85909
484623 85909 103332 130294 170821 231489 321157 443951 589890 741300 876807 967476 990571
484959 990571 950180 866995 759902 647969 552106 478590 421733 373733 329409 288081 251428
485295B51428l1376k8440k5732k2073j8438j5576j4799j2491r302p390p429o787
485661E1595n254n241l298k185k251k472j959q72j566k159j169j33j81M31j22
486119B3164j212j344m87k07Q9O08k14o37k49L40k58j726j864j51N08L85M13Q9
486668A7247o79k11k07k87l74q63j190q89l77k95q15j484q93J80N22K06j85L25
487217I731J646K012L56j474l90O53K23q70j430j002M2l81j188j875k39J814J060
487736H688J12N07J091J591J49r12j234j426k160j179M46P72j46o28j5r4K42O80
488286F484J118R19K94j659k548j597n38J41J47M03j98j447k27P00N17N2J72O38
488835C371L21k57j047K4J910K471J283q97k422j723l27N10O37M02r1M07J242
$$ plain form
485295 251428 220052 191612 165880 143807 125369 109793 94994 82503 73201 65811 58382 51595
485661 51595 46341 41100 37802 35617 33366 30894 28935 28063 26497 24338 23169 23036 22855 23286 23164
486119 23164 21952 20608 20121 19914 20003 20611 20397 19760 19511 19851 19593 17867 16003 15852 16360 16745 17158 17247
486668 17247 16568 16357 16150 15863 15489 14626 13436 12547 12170 11875 11060 9576 8683 8863 9385 9591 9406 9731
487217 9731 11377 13389 13745 12271 11881 12534 12757 11887 10457 9455 9497 9116 7928 6053 5814 7628 8688
487736 8688 8800 9307 10398 11989 12138 11226 9992 8566 6406 5227 5673 6445 6299 5671 5656 5562 5804 6484
488286 6484 7602 8521 8815 7156 4608 3011 2473 2614 2761 3164 2966 1519 1292 1992 2509 2561 2733 3371
488835 3371 3692 3435 2388 2412 4322 6793 8076 7179 4757 3034 2707 3217 3854 4256 4165 4572 5814
489354E814L56M59K95O20R77Q03k86j201q7N66n34o10L83O80J050k71j423j629
489903E962j053L12J412J134p34k724j345M7l07n3M23K57o29l02O90K092J054
490422F236q12o52p73o42m86R17N21m17j180j044L1J094L82l13QM19M29J177O83
491002E578K53L1q92p68j16K80nJ02K39j218j942q00o37l14J053J522j42k75R50
491582B899L54l98P60L92j071j766qJ034M76q85j136o72R4R20J147L87J20J64
492131B811l88j232n7J483J153J86k55j15P32J931J308K40j138k442j850n10M80
492650B337N86N67j54l84o66j391p06L67J071M41m14j126m50O02M52l33n11M96
493199G84M86O42N33l35m55P30J105M67j91r6K83P14Q49n22j758j443L3j02n55
$$ plain form
489354 5814 6170 6629 6924 7544 8521 9324 9038 7837 7750 8316 7782 7172 7555 8235 9285 9014 7591 5962
489903 5962 4909 5221 6633 7767 7033 4309 2964 3011 2704 2651 3074 3331 2702 2400 3090 5182 6236
490422 6236 5424 4772 3999 3357 2871 3788 4309 3892 2712 1668 1699 2793 3175 2862 2870 3289 3718 4895 5578
491002 5578 5831 5862 4970 4202 4086 4366 4361 4463 4702 3484 1542 742 105 -209 844 2366 2224 1949 2899
491582 2899 3253 2855 3615 4007 2936 1170 1162 2196 2672 1787 651 -21 73 993 2140 2527 2647 2811
492131 2811 2423 1191 1134 2617 3770 3956 3701 3586 4318 6249 7557 7797 6659 4217 2367 1857 2337
492650 2337 2923 3490 3336 2952 2286 895 189 556 1627 2068 1654 528 78 680 1132 799 288 784
493199 784 1270 1912 2445 2110 1655 2385 3490 3957 3766 3670 3953 4667 5516 4994 3236 1793 1826 1724 1169
493779A169L32Q17L27Q82O15P10m8l53r33p80n13k62n11l58Q9J750K246Q85L41
494359F405O79M2m56j059j365j760j305j44J090J47j44N99K17Q16Q84l26o12j628
494908B080o62l10q44L3J353J861J494K86p50J3J234P33j21q33q87q13m08l64
495457C095k82l65l83m32j96m41J61O84J212J582k19o73L43L95n51k41J07k37
496007C559K07J107P42j5j711k242q75l66R55J120j095k184k45J686J069J59P08
496526B579L40N17l21j114m06r73n46k90l42l20L39M0m95j69J227J673Q11P1m13
497105B208j277j310j268j714k53K191J984J81j069O05K334K164J895O64j003
497563F332q95l01L49q85p9M01r7q23j784j218P61J363K21l13K85P75L63k37r71
$$ plain form
493779 1169 1501 2318 2645 3527 4142 4852 4804 4451 3518 2738 2225 1963 1452 1094 1183 2933 5179 6064 6405
494359 6405 7084 7126 6670 5611 4246 2486 1181 1037 2127 2274 2130 2729 2946 3762 4646 4320 3708 2080
494908 2080 1418 1108 264 297 1650 3511 5005 5291 4541 4554 5788 6521 6400 5567 4680 3867 3459 3095
495457 3095 2813 2448 2065 1633 1437 996 1157 1841 3053 4635 4416 3743 4086 4481 3930 3689 3796 3559
496007 3559 3766 4873 5615 5600 3889 1647 772 406 1361 2481 1386 -798 -1043 643 1712 1871 2579
496526 2579 2919 3436 3115 2001 1595 622 76 -214 -556 -876 -537 -497 -992 -1161 66 1739 2550 2621 2208
497105 2208 931 -379 -1647 -3361 -3614 -1423 561 742 -327 278 2612 4776 6671 7335 6332
497563 6332 5437 5136 5485 4600 4521 4922 4825 4002 2218 1000 1761 3124 3345 3032 3317 4092 4455 4218 3247
498143C247m64L81O58M52k19q77j393l69J004O91m35k85J168Q74q12j465p83N55
498692A928J346Q78k79j104j062j670j798q45K184L262J064n80p00L76J519J081
499181E600J33j145j745j275o95M34L60M87J185J135m99k145j924j119N8q6j023
499699b264l77N80J088J201J786J815R09l38j061nM96j50m00j360j032p52j038
500218i02n57L65O51k53J62J019R72Q64N65K00l11m45P20n1j607j023P05M32O66
500798B172O67rk19m50j161l61O27R43N05M03N43P30j36K22K2K9O7M73J14j055
501409D126j699q30q61o95l29p08J43J674J351O48J069Q56P1p17j234q16N84J533
501958D166J345J216n20k899l250j504j40K94J531P57q5n15q77l39J397J442O26
$$ plain form
498143 3247 2783 3164 3822 4274 4055 3178 1785 1416 2420 3111 2676 2391 3559 4433 3621 2156 1373 1928
498692 1928 3274 4152 3873 2769 1707 37 -1761 -2606 -422 2840 3904 3324 2624 3000 4519 5600
499181 5600 5733 4588 2843 1568 873 1307 1667 2154 3339 4474 3975 1830 -94 -1213 -1155 -1241 -2264
499699 -2264 -2641 -2061 -973 228 2014 3829 4738 4400 3339 3334 3830 3680 3280 1920 888 136 -902
500218 -902 -1459 -1094 -443 -696 -534 485 1457 2321 2886 3086 2775 2330 3050 2999 1392 369 1074 1506 2172
500798 2172 2839 2830 2611 2161 1000 639 1266 2209 2714 3117 3660 4390 4254 4476 4498 4527 4594 5067 5181 4126
501409 4126 2427 1597 736 41 -288 -996 -853 821 2172 2820 3889 4745 4816 4099 2865 2049 2633 4166
501958 4166 5511 6727 6207 3308 58 -1446 -1586 -1292 239 996 911 396 -481 -820 577 2019 2645
502477B645P52N12r80j545n57M06j411j168K64N10K47j14P96P46k93p91p94J99
503026e76L54j55o40j55L78N0M99J763J058K41m03j629o30P41Q16J076J415L50
503575D553p22j32J348R71j25n74p90l45l6q0j244j040m20O04J13j87k83J39m8
504155A702n16l62n87N3L58l73p48p97m99j29j5m76P72J871J107m4j028j177p96
504735a684P89J613P41j915k151Q02K508J328m04m27J45R25J59m48O9P31J685
505254D466L77m13n21o97j255o07J029K22q69p54l65j018j685o62P43R52pq55
505803a919j675m40J403K509K172O98k38K10m18p5J133j18j232j761j43J079J525
506322B710K21p67p59j604j229n16K1P64O54N63J032Q19L13O21Q42J150%j299
$$ plain form
502477 2645 3397 3909 2929 1384 827 1233 -178 -1346 -1082 -572 -325 -439 357 1103 810 19 -775 -576
503026 -576 -222 -377 -1017 -1172 -794 -744 -245 1518 2576 2817 2414 785 155 896 1712 2788 4203 4553
503575 4553 3831 3699 5047 6018 5893 5319 4529 4184 4148 4068 2824 1784 1364 1968 2081 1894 1611 1750 1702
504155 1702 1186 824 237 290 648 275 -473 -1270 -1769 -1898 -1913 -2389 -1617 254 1361 1317 289 -888 -1684
504735 -1684 -895 718 1459 -456 -2607 -1805 703 2031 1627 1200 1345 2270 2429 1981 2050 2781 4466
505254 4466 4843 4430 3909 3212 1957 1350 2379 2601 1732 978 613 -405 -2090 -2752 -2009 -1057 -1064 -1919
505803 -1919 -3594 -4034 -2631 -122 2050 2748 2510 2720 2302 2227 3360 3242 2010 249 106 1185 2710
506322 2710 2931 2164 1405 -199 -1428 -1944 -1923 -1159 -505 58 1090 1909 2222 2843 3685 4835 4835 3536
506871C536o03P05m42j848o79l41K55J503Q26K55M92m48o60n29J86K82r04j223
507421C63q82L95Q13n95q80j732j247Q30N79Q89N33j019j872k159n93J210J081
507940d286O90Q53K42l90j15o1Q52K01q28M40J612J126j47jN93R89O16p41q50
508519G95N12K034J605M91o94j571j702K65N88M87j6p67n22R56J713P92j079j324
509069B563o36K72R63L72n37l8M01L53J96j95r43j017l66R70L74m42n20L67N70
509648B707Q17J55o75j302n77kJ74q99k173o47K85P52J351Q34p66j431J50Q80
510198c67P30R64J211m47k275j645J77J267J044R16Q0j024q19l08K62L28J17j20
510747I1r90K38J359J226J142K87n51j279m40K47o32j455k85J06j97P27Q44J119
$$ plain form
506871 3536 2933 3638 3196 1348 669 328 583 2086 2912 3167 3659 3211 2551 2022 2208 2490 1586 363
507421 363 -519 -124 689 94 -786 -2518 -3765 -2935 -2356 -1467 -934 -1953 -3825 -5984 -6577 -5367 -4286
507940 -4286 -3596 -2743 -2501 -2891 -3006 -3067 -2215 -2014 -2842 -2402 -790 336 189 188 781 1770 2386 1645 795
508519 795 1307 3341 4946 5437 4743 3172 1470 1735 2323 2810 2794 2027 1505 2461 4174 4966 3887 2563
509069 2563 1927 2199 3162 3534 2997 2959 3360 3713 3909 3714 2771 1754 1388 2358 2732 2290 1770 2137 2707
509648 2707 3524 3679 3004 1702 1125 1123 1297 398 -1775 -2422 -2137 -1385 -34 800 34 -1397 -1247 -367
510198 -367 363 1327 2538 2091 -184 -1829 -1652 -385 659 1575 1655 631 -188 -496 -234 94 211 91
510747 91 -899 -661 698 1924 3066 3353 2802 1523 1083 1330 698 -757 -1042 -936 -1133 -406 438 1557
511297A557J556O48J15M59Q2k01o1j55k64r2l61p06J0m3K09M60k23j124j827q23
511907g84K9n02j488j611q66J13J11L84J097J709J738J412R09n67l87J63m72J0
512456I98N59K08j42L16q21j024L93J278P99P5L41N89n65j233o78J118o0l43J152
513036B960N47l09n25r07j844j721l19R52J300J73J50O26N30j329n50q9m48j30
513585i33P45K87n75L58L27o6O24O09J179p2j142j19j57q76q46J28L57n20j122
514165a814j04J207K520J496j409j174N65R03j05n18o63l07q26j154q84r19J6
514684c170J166J434J791J819J368K14q87r63M9L20M00q31j516o72n06p15o16
515203a315K82k07pP74J046N12q74q33J092K365J285O54j494k152j546j880r54
$$ plain form
511297 1557 3113 3761 3876 4335 4417 4216 4155 4000 3736 3644 3283 2577 2587 2544 2753 3213 2990 1866 39 -784
511907 -784 -755 -1257 -2745 -4356 -5222 -5109 -4998 -4614 -3517 -1808 -70 1342 2251 1684 1297 1460 988 998
512456 998 1557 1765 1623 1939 1118 94 487 1765 2564 2639 2980 3569 3004 1771 1093 2211 2151 1808 2960
513036 2960 3507 3198 2673 1766 -78 -1799 -2118 -1166 134 307 457 1083 1613 284 -266 -355 -803 -933
513585 -933 -188 99 -476 -118 209 143 767 1376 2555 2483 1341 1222 1065 189 -657 -529 -172 -692 -1814
514165 -1814 -1918 -711 1809 3305 1896 722 1287 2190 2085 1567 904 597 -229 -1383 -2267 -3186 -3170
514684 -3170 -2004 -570 1221 3040 4408 4622 3735 2772 2821 3141 3541 2710 1194 522 16 -699 -1315
515203 -1315 -1033 -1240 -1247 -473 573 1085 211 -622 470 2835 4120 4774 3280 1128 -418 -2298 -3252
515722c252M05R52J408N06k48l02O45J423J35j578k83J218R33R6o32n57l69j400
516271i00p35M56K36K02J188L25n66J39l30m43R18M79q15j96R01J420O01O95O93
516851D268r05j399l39k81J07N80J73m08L17R67Q46m75n99M10m4q29p63l71k20
517431A035M1K92M44Q00L63n03O32P02p35r16N03J214k43j024p88j2K72k81o78
518011A118N3J312J091j012j920j271m67M49J308N89N93k23k43j42q00o53O24
518529D06K29o9O14P43j91r18n23L27J180J511K64j155j848j025O7m85j998j025
519079c896O8J156K036J181k3N1J278N04n68n46o7o16j142n28j4q74q65l92q54
519658d111m19J007J109Q49Q62Q45N33j10O67J814J408N43N28l8j007j341k028
$$ plain form
515722 -3252 -2847 -1895 -487 19 -229 -531 114 1537 1672 94 -189 1029 1962 2058 1426 869 500 -900
516271 -900 -1635 -1179 -943 -741 447 772 206 345 15 -428 490 969 154 -42 859 2279 2880 3575 4268
516851 4268 3363 1964 1625 1344 1451 2031 2204 1796 2113 3080 3926 3451 2852 3262 3218 2389 1626 1255 1035
517431 1035 1076 1368 1812 2612 2975 2472 3104 3806 3071 2155 2658 3872 3629 2605 1817 1805 2077 1796 1118
518011 1118 1171 2483 3574 2562 642 -629 -1096 -647 661 1250 1843 1620 1377 1235 435 -218 406
518529 406 635 566 1180 1923 1732 814 291 618 1798 3309 3573 2418 570 -455 -388 -873 -2871 -3896
519079 -3896 -3828 -2672 -636 545 522 573 1851 2355 1787 1241 1174 558 -584 -1112 -1126 -2000 -2865 -3257 -4111
519658 -4111 -4530 -3523 -2414 -1565 -703 142 675 565 1232 3046 4454 4997 5525 5487 4480 3139 1111
520177A111j365n84Q37J879O64o43p92k94j68l44j165j235J06J612J821J890J038
520696D368o53j181l0J614J306O79q49j827q84l2O05O81r40j448p17n39k67J038
521246I24N44l99k43O04P10N34n5p73j91k46p86o24j00Q12P23l7j211k132k196
521825d142j662o1M6J039J801K679L156J665J008J028Q05N02n26r35k031l83O60
522344D649j411k437j301p02p51k67j36P30N35M29m13K04R03J155K17j202j338
522863a136l83m10J51M21R96Q13m2o94o61l64k2L25J7j63Q37J311O74M5N8q0N42
523504B235P69o65m45j2j086j085j241j324j1Q66M46r23o89O56J330J285M42m98
524053E0q78j061o51J37K45M70M11n96j558l33M58l54j188N3R58J406J082N80
$$ plain form
520177 1111 -254 -838 -1 1878 2542 1899 1107 813 645 301 -864 -2099 -1993 -381 1440 3330 4368
520696 4368 3715 2534 2504 4118 5424 6103 5254 3427 2543 2511 3116 3797 2857 1409 692 153 -114 924
521246 924 1468 1069 826 1430 2140 2674 2619 1846 1655 1409 623 -1 -101 711 1434 1397 186 -1946 -4142
521825 -4142 -5804 -5865 -5819 -4780 -2979 -300 2856 4521 5529 6557 7362 7864 7338 6403 4372 3989 4649
522344 4649 3238 801 -500 -1202 -1953 -2220 -2356 -1626 -1091 -662 -1075 -871 32 1187 1404 202 -1136
522863 -1136 -1519 -1929 -1778 -1357 -361 452 410 -284 -945 -1309 -1331 -1006 -989 -1152 -315 996 1670 1715 1773 1693 2235
523504 2235 3004 2339 1894 1882 796 -289 -1530 -2854 -2865 -1999 -1553 -2476 -3165 -2509 -1179 106 548 50
524053 50 -828 -1889 -2540 -2403 -2158 -1688 -1277 -1873 -3431 -3764 -3306 -3660 -4848 -4795 -3837 -2431 -1349 -769
524602g69j33o83p61q04M09J293M90J052P22p80j720j953o79J191J288O23J81
525121a033l92j322o59O63J120J060P62K40j22j070l4M02L68J273J424q8o41l08
525671A643j22J69o13j125q52j637j155J73Q27K059J225N98J196O91K57n65j019
526190A750n74j75l94l45J98Q68J712O83j314j002K88p77j763r05o97j42N56M25
526739a608J41m66j068QJ643J109R7k09Lp32j809j667J0J461K412J987J015O8
527288B395p51r35k67N47M02m69p68oL47o77K13N22lm0l16l16R25J621L28n42
527899B210k46m63MJ18L65J087n0r2p11j035p00j552l87J089K43j02M64K76J96
528478G14M44P5l22m78j8J563J657M53k48l62n78j184j043j535j44J768Q04o79
$$ plain form
524602 -769 -902 -1585 -2346 -3150 -2741 -1448 -958 94 816 36 -1684 -3637 -4316 -3125 -1837 -1214 -1033
525121 -1033 -1425 -2747 -3406 -2743 -1623 -563 199 439 317 -753 -787 -385 -17 1256 2680 2592 1951 1643
525671 1643 1521 1690 1077 -48 -900 -2537 -3692 -3519 -2692 -633 592 1190 2386 3077 3334 2769 1750
526190 1750 1176 1001 607 262 460 1328 3040 3723 2409 1407 1695 918 -845 -1750 -2447 -2589 -2033 -1608
526739 -1608 -1467 -1933 -3001 -2993 -1350 -241 -144 -353 -350 -1082 -2891 -4558 -4548 -3087 -675 1312 2327 2395
527288 2395 1644 709 442 989 1391 922 154 148 495 -182 31 553 550 510 194 -122 803 2424 2752 2210
527899 2210 1964 1501 1505 1623 1988 3075 3025 2933 2222 1187 487 -1065 -1452 -363 -120 -222 242 518 714
528478 714 1158 1233 911 433 415 1978 3635 4088 3840 3478 2900 1716 673 -862 -1006 762 1566 887
529028H87j200l96L92P67J412J174o20j334r16q95n71NN52L43J365J038k63q16
529577I24l41r99j611k03J174J278O36m7O6J072L74r08j431j513q53N82J097K52
530126d51M33Q90j71j97o68M08J812J950K91l15k52K9P39J09N6K05l1j144j649
530706B044n88n4q81p63J05L14M2l52p50J47J373L35Q55O76J5K16o94j268j022
531286b50QJ079P3j600j450r31j18J227J739J019k00O4Q32P72j062j292r74k87
531835a351Q72K048J807L85j079j172n44n4j96N14J602O40j285j784N44J372J80
532354B499n3J6M33Q6j057k259j820N91J298J50r86j000q81L24J194M84j243o13
532904b837P31J20J079L77n51l99K29J780J334l96n44J00j22K12Q71J05j097q55
$$ plain form
529028 887 -313 -709 -317 450 1862 3036 2416 1082 166 -729 -1300 -1295 -743 -400 965 2003 1740 924
529577 924 583 -416 -2027 -2230 -1056 222 858 811 877 1949 2323 1415 -16 -1529 -2382 -1800 -703 -451
530126 -451 -18 872 701 504 -164 244 2056 4006 4297 3982 3730 3759 4498 4607 4663 4868 4837 3693 2044
530706 2044 1456 1402 521 -242 -137 177 219 -133 -883 -736 637 972 1827 2503 2518 2734 2040 772 -250
531286 -250 -242 837 910 -690 -2140 -3071 -3189 -1962 -223 796 596 660 1492 2264 1202 -90 -1064 -1351
531835 -1351 -479 1569 3376 3761 2682 1510 966 912 716 1230 2832 3472 2187 403 947 2319 2499
532354 2499 2446 2462 2895 2981 1924 -335 -2155 -1564 -266 -116 -1102 -2102 -2983 -2659 -1465 -981 -2224 -2837
532904 -2837 -2106 -1986 -907 -530 -1081 -1480 -1251 529 1863 1467 923 1023 901 1113 1984 2089 992 137
533453A37L40N50L34M73J2n21r61l15N92j16j00Q55Q62M97L58J55j123k79J153
534033B903O96p05j003p3J946K095Q34L29n44j123j666p56O12o2j313j846j317
534551i93r86j662j257J52J501J500J409Q16o72l82j21P13J624R93J072R87M6
535070D740J82P77j01k41k90j079j459m02J56l67m06p49o60O02O58m05o14L62
535620G04M47l96m74O0p43r20K43R63O42p7P2P58N42J76m52q24k56J232P27q54
536230A570O64J743J545J500N8j808k103j224j407n14J425N25l29K15Q40p61q18
536749A121r3M4P3m2N32R00Q43J77k72m63m15j68m48q62n45K50L00J57j241j060
537359a212O48M20L21O34j91j561j458p77L90O73Q98J14J72k0qj010o46J29m29
$$ plain form
533453 137 477 1027 1361 1834 1846 1325 364 49 641 525 425 1280 2142 2639 2997 3152 2029 1750 2903
534033 2903 3599 2894 1891 1818 3764 5859 6693 7022 6478 5355 3689 2933 3545 3483 2170 324 -993
534551 -993 -1979 -3641 -4898 -4746 -3245 -1745 -336 480 -192 -574 -695 18 1642 2635 3707 4694 4740
535070 4740 4922 5699 5598 5357 5067 3988 2529 2127 2283 1916 1510 761 101 703 1361 956 342 704
535620 704 1151 755 281 341 -402 -1322 -1079 -116 526 449 521 1279 1821 1997 1545 721 465 1697 2424 1570
536230 1570 2234 3977 5522 7022 7080 5272 3169 1945 538 24 1449 1974 1645 1860 2700 1939 1121
536749 1121 1028 1072 1145 1103 1635 2535 3378 3555 3283 2820 2405 2237 1789 927 382 632 932 1089 -152 -1212
537359 -1212 -564 -144 177 811 620 -941 -2399 -3176 -2786 -2113 -1215 -1101 -929 -949 -957 -1967 -2613 -2484 -2913
537939b913J4J031Q95J476J022n96m92L28n9M47P09o37p58j353o19L54M78j71
538488h44l91k35l63M56L87l91N1R02R49O72M1P4r2Q19J754N67l86m40o56j147
539099A727p39J63L25m1k90R5j252q86j6N95Q05R54P76J078J035M73k56p82q18
539679B946j275j358k12O83J235J438J200P10J079J014m65j178j902j527M2R78
540167C408J354J619M52q87j280j518j924j120R52P00o10j000o87J030P55P75
540655B019P53m93p77P94J461N96q79j769k331j595k05l66j210j284L04M54R72
541174c556K061J806j99j100p6J184J035M79o01m51O02J417Q89k91r95j060j304
541693a60q27n76n51j43L89J032k45J69J161R11N55L2j038p20p27j535l89L35
$$ plain form
537939 -2913 -2899 -1868 -973 503 1525 929 437 765 706 1153 1862 1225 467 -886 -1505 -1151 -673 -844
538488 -844 -1235 -1470 -1833 -1377 -990 -1381 -1330 -428 521 1193 1234 1308 1216 2035 3789 4356 3970 3530 2874 1727
539099 1727 988 1151 1476 1435 1145 1240 -12 -898 -914 -319 486 1440 2216 3294 4329 4802 4546 3764 2946
539679 2946 1671 313 101 784 2019 3457 4657 5367 6446 7460 6995 5817 3915 2388 2430 3408
540167 3408 4762 6381 6833 5946 4666 3148 1224 104 1056 1756 1146 146 -541 489 1244 2019
540655 2019 2772 2279 1502 2296 3757 4353 3474 1705 -626 -2221 -2426 -2792 -4002 -5286 -4982 -4528 -3556
541174 -3556 -1495 311 112 -988 -1064 120 1155 1634 1033 582 1184 2601 3490 3199 2204 1144 -160
541693 -160 -987 -1563 -2114 -2257 -1868 -836 -1081 -912 249 1160 1715 1747 709 -11 -738 -2273 -2662 -2327
542242b327K68K38m34m78o26N4J075J222J246k15j668n78J27N60J228J204O03
542761A499k3R0J032O78k08n28r88q86m44o34j181j984j388J676K246N88J110
543280F55K21k30O10l58p30j340q50P65R94P34j39r5j19o22p15j031j832j979
543829f061M3K90k23N27R43L80j073k82J316J068J45Q69J801J137k45j059j96
544348f20J465l26q53L56Q82M03r2r03q26k86n92o45l37m91o74p27Q66Q86p34
544928c248m80m3j139j341M8J510J491N20m78l1R89J294J721J821M56J83L99L6
545477C708p5M3j69j272j272j034j98O66J704J300m67p15P0R63O51j62j344j591
546027H06j103r37q37j49M1l67P88J152P56Q20J75l46K62M4M2R8m84j081j782
$$ plain form
542242 -2327 -2059 -1821 -2255 -2733 -3359 -3305 -2230 -1008 238 23 -1645 -2223 -2096 -1536 -308 896 1499
542761 1499 1476 1566 2598 3276 3068 2540 1552 666 222 -412 -1593 -3577 -4965 -3289 -1043 -455 655
543280 655 876 646 1256 898 168 -1172 -2022 -1257 -263 471 332 237 118 -504 -1219 -2250 -4082 -6061
543829 -6061 -6018 -5728 -5951 -5424 -4481 -4101 -5174 -5456 -4140 -3072 -2927 -2058 -257 880 635 -424 -620
544348 -620 845 519 -334 22 904 1307 1215 312 -514 -800 -1392 -2037 -2374 -2865 -3539 -4266 -3400 -2514 -3248
544928 -3248 -3728 -3771 -4910 -6251 -6203 -4693 -3202 -2682 -3160 -3191 -2202 -908 813 2634 3090 3273 3672 3708
545477 3708 3633 3676 3507 2235 963 -71 -269 397 2101 3401 2934 2219 2289 3252 3903 3741 2397 806
546027 806 -297 -1234 -2071 -2220 -2179 -2546 -1758 -606 150 970 1145 799 1061 1105 1147 1245 761 -320 -2102
546607b102o56O6m07P3M08Q37R86k72j201o8J752K223R51L9m16j772j832q38L99
547186a830J394M99r21o39J625J794Q24P89N66q5J07J322J036j233l006j332M94
547705A404J359L31n9p63j297j049j453n57P34R88P11K04Q3j614j868L05P92l9
548254a788j99j78K09l16q29J25J307P93l18q9R51Q19R1l47l4M02M12J456J656
548834D123q18k023j472n82j361j311j59L90M03O87N79P3J063J379J019J167J095
549353D252j52k66l4m03Q00J274M22o02j207k029k069m41Q37L16K01M47l82p27
549902B37p55k75M02k39j135j211p21N46J094J053L91m27j168j043j47N02K39
550421b657j71p65m96Q55L28j131r30J760K326R14M34J447M48p73r74m36k5n34
$$ plain form
546607 -2102 -2758 -2692 -3099 -3026 -2618 -1781 -795 -1067 -2268 -2336 -584 1639 2590 2629 2213 441 -1391 -2229 -1830
547186 -1830 -436 63 -858 -1497 128 1922 2746 3535 4101 4016 4123 5445 6481 5248 2242 910 1404
547705 1404 2763 3094 3035 2272 975 -74 -1527 -2084 -1350 -362 349 553 636 -978 -2846 -2541 -1749 -1788
548254 -1788 -1987 -2165 -1956 -2272 -3101 -2976 -1669 -876 -1194 -1283 -332 487 578 231 197 599 1011 2467 4123
548834 4123 3305 1282 -190 -772 -2133 -3444 -3603 -3213 -2810 -2123 -1544 -1471 -408 971 1990 3157 4252
549353 4252 4100 3834 3800 3397 4197 5471 5893 5291 4084 2055 -14 -455 382 698 899 1346 964 237
549902 237 -518 -793 -391 -630 -1765 -2976 -3697 -3151 -2057 -1004 -613 -1040 -2208 -3251 -3398 -2896 -2657
550421 -2657 -2828 -3593 -4089 -3234 -2906 -4037 -4967 -3207 -881 33 467 1914 2362 1589 615 179 154 -380
550971c80n21j309j399k79J836K559j28j134K7M93L21N29L88l33M24R58L69o00
551520A821j126k85R19o30p55l07j81J046O27k12l05O20Q06r45j821j018o62K25
552069b183J138L66P57J415P73P7K05Q65Lj343j146q43o9k83q04O59J161po39
552649A02L32J237K484K336Q9j27K55J270J376m14j458k549k039j36N89m9M41
553168C739r20j092j29N88J042J911J535k02j366j147j257j687j814j50N1r20
553656a818m32m28j338n70L57O61J416P83R89J838J197R08K89k89j03j65K27l81
554205C141r92p1j7j22L76K3o33j013l99M19M62p16o73k73k11j32p2p53j144m78
554816c278J863K224J84o90j824q84P88Q49L92k37l00Q76J64n87o45m00m8r35
$$ plain form
550971 -380 -901 -2210 -3609 -3888 -2052 507 379 -755 -728 -235 86 615 1003 670 1094 2052 2421 1821
551520 1821 695 410 1329 699 -56 -363 -544 502 1129 917 612 1232 2038 1093 -728 -1746 -2408 -2183
552069 -2183 -1045 -679 78 1493 2266 2343 2548 3413 3416 2073 927 84 15 -268 -1072 -413 748 741 102
552649 102 434 1671 4155 6491 6580 6453 6708 7978 9354 8940 7482 4933 2894 2758 3347 3298 3739
553168 3739 2819 1727 1598 2186 3228 5139 6674 6472 5106 3959 2702 1015 -799 -949 -898 -1818
553656 -1818 -2250 -2678 -4016 -4586 -4229 -3568 -2152 -1369 -380 1458 2655 3563 3852 3563 3460 3295 3522 3141
554205 3141 2149 2078 2061 1939 2315 2338 1705 692 293 712 1174 458 -215 -488 -699 -831 -903 -1656 -2800 -3278
554816 -3278 -1415 809 993 303 -1521 -2405 -1617 -768 -376 -613 -913 -37 127 -460 -1105 -1505 -1553 -2488
555365b488j123p54j80J023J227K59p71P24J396J132J033L66o08r69L80l19J2
555884C40J058q9m70m53p10P37K467J738p97j291r1j08j44K41L50p85r21p76j966
556464a670k029O04J652k94r97M43K81o35m82k24m1N52L82L02m11J4J058N26j69
557044a138q17l98M89L40j92J14J67p38j258o10L55J591J380J177Q27r82j970
557563a663j835p73K25L24k89J03M21j15J158J332J55l79m14N35l20j051m35N20
558112b501J400J099M01Q51R77J47k7M64L22j18P20J728J149o85j509n97k4P37
558661D534R91q34j948k351j610n57L81N20R42J103K51m09j80L69J233M66n78
559180B323r36m68m9k21L95Q24L7o40j713j811o86m0l00L80Q67k43q54n22m89
$$ plain form
555365 -2488 -3611 -4365 -4545 -3522 -2295 -2036 -2807 -2083 -687 445 1478 1844 1236 267 647 328 340
555884 340 1398 1309 839 386 -324 413 2880 4618 3821 2530 2439 2331 2187 2428 2778 1993 1072 296 -1670
556464 -1670 -3699 -3095 -1443 -1737 -2734 -2291 -2010 -2645 -3127 -3351 -3392 -2840 -2458 -2156 -2567 -2553 -1495 -969 -1138
557044 -1138 -1955 -2353 -1864 -1524 -1716 -1602 -1435 -2173 -3431 -4041 -3686 -2095 -715 462 1289 307 -1663
557563 -1663 -3498 -4271 -4046 -3722 -4011 -3908 -3487 -3602 -2444 -1112 -957 -1336 -1750 -1215 -1535 -2586 -3021 -2501
558112 -2501 -1101 -2 399 1250 2227 2374 2347 2811 3133 3015 3735 5463 6612 5927 4418 3821 3797 4534
558661 4534 5525 4691 2743 392 -1218 -1775 -1394 -874 68 1171 1422 1013 833 1202 2435 2901 2323
559180 2323 1387 919 870 649 1044 1868 1905 1265 -448 -2259 -2945 -2985 -3285 -2905 -2038 -2281 -3135 -3657 -4146
559760d146O81J746O31j75m77M44J312J387J369M07m48p39k28M13p23n95j04p71
560309a6j512j253J82K39k63m65L25J600J916m9j595j533o51j00R7J325J343K32
560859a78k60M61K55j085r59P42J090J653J849R69j50l87n03o85m33j396j712
561377g29K08J450l94q34J90J286J384M43l36r70j486L36O71Q64P95N70j659l190
561927a401j752j192j161J14J727J844J325P08p4P58J759J149M37m4m79k09J031
562445D540N04n66j425j874p29j46k35Q62K282Q60j281k110j649j82O01j44o79
562964a371j42m50k0J70k98L24J316P13L74L98J07m52j303r8J100J562L05l01
563513A934j462j571N9M07n0l37n94L71L79K40R82N02q97m49m48j202j013O78
$$ plain form
559760 -4146 -3465 -1719 -1088 -1263 -1740 -1296 16 1403 2772 3179 2731 1992 1764 2177 1454 859 755 -16
560309 -16 -1528 -2781 -2599 -2360 -2623 -3088 -2763 -1163 753 704 -891 -2424 -3075 -3175 -3078 -1753 -410 -178
560859 -178 -438 23 278 -807 -1766 -1024 66 1719 3568 4537 4387 4000 3497 2812 2379 983 -729
561377 -729 -521 929 535 -299 -109 1177 2561 3004 2668 1698 212 548 1219 2083 2878 3448 1789 -1401
561927 -1401 -3153 -4345 -5506 -5392 -3665 -1821 -496 212 138 896 2655 3804 4241 4197 3718 3509 4540
562445 4540 5044 4478 3053 1179 450 304 69 931 3213 4073 2792 682 -967 -1149 -548 -692 -1371
562964 -1371 -1513 -1963 -1983 -1813 -2111 -1787 -471 242 616 1014 1121 669 -634 -732 368 1930 2235 1934
563513 1934 472 -1099 -1040 -633 -683 -1020 -1614 -1243 -864 -624 358 860 -37 -486 -934 -2136 -3149 -2471
564063b471O61K427K623N75l61Q50N75r14j032p04m65R39P73j23j114j159n08
564582E72p80l20K79N15q3o19l46J30O27N89j77m83k71M58P01j99p99o62P90J595
565192A517J541J233Q00q13j517p35p03j156K56K127J106m42j121m30J389J320
565681D372j15o11j209j341k47l58j772n39P77m82n07O50N19l15l64p77M11R96
566230i12P87N57n16o53MP50Q90K97J02N66J08m36j400j650l04Q83P60K29m81
566810d19j103n38L85P83J140J335L51j06Q07M48L9Q6Q14O44n78k84j90j97J43
567389C560q1L39k82j066j230j09kL8J507J824j48k025j741j378o49J29q68j376
567939c558J105J569P07K55q15m18M49k26q69J45R29O45n1j57l8k89o02L84J849
$$ plain form
564063 -2471 -1810 617 3240 3815 3454 4304 4879 3965 2933 2229 1764 2703 3476 3353 2239 1080 572
564582 572 -208 -528 -249 266 183 -436 -782 -652 -25 564 387 -96 -367 91 792 593 -206 -868 -78 1517
565192 1517 3058 4291 5091 4278 2761 2026 1323 167 423 2550 3656 3214 2093 1663 3052 4372
565681 4372 4257 3646 2437 1096 849 491 -1281 -1820 -1043 -1525 -2032 -1382 -863 -1178 -1542 -2319 -1908 -912
566230 -912 -125 432 -84 -737 -733 17 907 1204 1306 1872 1980 1544 144 -1506 -1810 -927 -167 62 -419
566810 -419 -1522 -2060 -1675 -892 248 1583 1934 1828 2635 3083 3122 3208 4022 4666 4088 3804 3614 3417 3560
567389 3560 3479 3818 3536 2470 1240 1131 1129 1167 2674 4498 4350 2325 584 -794 -1443 -1314 -2182 -3558
567939 -3558 -2453 -884 -177 78 -737 -1155 -706 -932 -1801 -1656 -727 -82 -133 -290 -328 -617 -1219 -835 1014
568519A014J182j31l29p93j561p64O00O57o4j80R08L00l03O4M2j049k74J72N83
569098G4J385J316J16q32j49J28k5q8j199o06K57q4M25P65K71j345k039n38J331
569678h37J050M55m83j50N67K20p94r54o32J56J837J853L84o05j408n36j187r48
570228b012K68J453J719Q34j061j457Kj27j159j237j186l60P00J559J20j014n07
570747c465J382J965L90k12L57J342P70K9k62o14p42n28n83l60q30j892p84O49
571296c388P93M31O91L11j144k71J069J827K020R89M7n76q06j464j595j72L03
571815i35N0K36J312J337k71l65N1l71q17P37J242P67L76j109k007j299k83J94
572364a155K30O22J096R1l6P84N44L44o16r02l24o09q96q96j225k31O08Q87P49
$$ plain form
568519 1014 2196 2065 1736 943 -618 -1382 -782 -125 -189 -369 539 839 536 600 642 -407 -681 -509 74
569098 74 1459 2775 2891 2059 1910 2038 2013 1925 726 120 377 293 718 1483 1754 409 -1630 -2168 -837
569678 -837 213 668 185 35 602 822 28 -926 -1558 -1402 435 2288 2672 2067 659 123 -1064 -2012
570228 -2012 -1744 -291 1428 2262 1201 -256 -254 -381 -1540 -2777 -3963 -4323 -3623 -2064 -1944 -2958 -3465
570747 -3465 -2083 -118 272 60 417 1759 2529 2558 2296 1682 940 412 -171 -531 -1361 -3253 -4037 -3388
571296 -3388 -2595 -2164 -1473 -1162 -2306 -2577 -1508 319 2339 3328 3375 2799 1993 529 -1066 -1238 -935
571815 -935 -885 -649 663 2000 1729 1364 1415 1044 227 964 2206 2973 3349 2240 233 -1066 -1349 -1155
572364 -1155 -925 -303 793 884 848 1632 2176 2520 1904 1002 678 69 -827 -1723 -2948 -3179 -2571 -1684 -935
572944i35P17R89J803P43l37r05o81O98O73o90k86M66M90j29k63j195q66r94k278
573524b980p48J185J213K02m71L45L20o3n8L37P21O57K34o71q57L16K21M56j18
574103B41j246k74J218N95J16j12j35N05J025J309J57M44P20Q4j24l54j175j380
574653A614j303j433j013P0P96J525J448K6l98J17j95l74j82N19m99p48N14L75
575202H59l82q65L36J482M14J8p75j362j212j266j078q04R6L05j51m34J23N88
575752d108J281M04o87p68J32P61J186J012O30M98J69k44K58L06r34p44L46J084
576301E82lN03J487o46k120k039j837n63R15J557J406J23K14r3m79l68N61J973
576850A173J823O30m00l06P92j27k52L32k0N3M1m66M9l20j375j901j238r81l60
$$ plain form
572944 -935 -218 771 2574 3317 2980 2075 1394 2092 2765 2075 1789 2255 2745 2616 2353 1158 292 -702 -2980
573524 -2980 -3728 -2543 -1330 -1128 -1599 -1254 -934 -997 -1055 -718 3 660 894 223 -634 -318 -97 359 241
574103 241 -1005 -1279 -61 534 650 538 403 908 1933 3242 3399 3843 4563 4647 4523 4169 2994 1614
574653 1614 311 -1122 -2135 -2065 -1269 256 1704 1730 1332 1449 1254 880 698 1217 718 -30 484 859
575202 859 477 -388 -52 1430 1844 1862 1087 -275 -1487 -2753 -3831 -4635 -4539 -4234 -4385 -4819 -4696 -4108
575752 -4108 -2827 -2423 -3110 -3878 -3746 -2985 -1799 -787 -157 341 510 266 524 830 -104 -848 -502 582
576301 582 579 1082 2569 1923 -197 -2236 -4073 -4636 -3721 -2164 -758 -635 -421 -514 -993 -1361 -800 1173
576850 1173 2996 3626 3226 2920 3712 3585 3333 3665 3645 3698 3739 3273 3322 3002 1627 -274 -1512 -2493 -2853
577430b853J172J243P15k49j473q09O62P04p56q32O85L09n45N7J011N73j97O16
577979C3O76n43j666j818j220m79m12R52K594K035K0n39j13P3J85J126O05k63
578529A246P1J151J416N99N28m50n61r11q81m25o34l08J190J33p54k67M7L42m31
579109A101L80J038L25M27Q45M97O3J002O90j235j418j972j546N85J103N83O44
579628C112O27Ko37k2J056N20M32K7j346j720J0l84l87K10q22p45l68P74J408
580207A747k09j378j00O70O52m22r20m36q41pJ355J264P9l85J37N15j32o16r13
580787F0Q29J342m85n72R0N50L46j25j178j257P7l22j109j225P0k03j57M30M38
581367b401L62O58M10j520j374k8Q36R91R72R55N5l42j66l19J35L16o70j863q86
$$ plain form
577430 -2853 -1681 -438 277 28 -1445 -2254 -1592 -888 -1644 -2476 -1791 -1482 -2027 -1970 -959 -386 -583 33
577979 33 709 166 -1500 -3318 -4538 -5017 -5429 -4477 -1883 152 172 -367 -480 -407 -222 904 1509 1246
578529 1246 1317 2468 3884 4483 5011 4561 4000 3089 2208 1783 1149 841 2031 2164 1410 1143 1190 1532 1101
579109 1101 1481 2519 2844 3271 4116 4613 4676 5678 6368 5133 3715 1743 197 782 1885 2468 3112
579628 3112 3739 3741 3104 3082 4138 4658 5090 5117 3771 2051 2061 1677 1290 1500 678 -67 -435 339 1747
580207 1747 1538 160 60 730 1382 960 40 -396 -1237 -1244 111 1375 1454 1069 1206 1721 1589 973 60
580787 60 889 2231 1746 1174 1264 1814 2160 2035 857 -400 -323 -645 -1754 -2979 -2909 -3112 -3269 -2839 -2401
581367 -2401 -2039 -1381 -971 -2491 -3865 -3893 -3057 -2066 -1094 -139 -84 -426 -592 -911 -776 -460 -1130 -2993 -3879
581947c879J089J279M75Q60j3n87O11J512P35L6R51k19j691j930r48r5m5J48N66
582527a145Q18P75J327O71O28J033J19j547r22l68p39l33o51j698o52R5L82J119
583076a088J235J236J153l79j149o15j23M63Q05j24q07j50J58k76o55m68k35K44
583625g75J77O85R65P0q22J475J594K72n7o50q50n08K49L77o62j403K20J637J310
584205C304K69n11j044o99j37j00J34L94L53mj60K92J892K276J002l81qO83o75
584785F880j733j390j35l97p15o72r21j352o14p73j146o80L09P93P52L34m58J5
585334a903J083R77J84j310j946j257L35Q06R25Q38M73K51l14j95J505J829j104
585853A177j757K54O43l30j39o31q06l66J212M33l86J88J15M33Q12J50r61j281
$$ plain form
581947 -3879 -2790 -1511 -1036 -176 -189 -776 -165 1347 2082 2118 3069 2850 1159 -771 -1719 -1814 -1859 -1711 -1145
582527 -1145 -327 448 1775 2446 3074 4107 4226 2679 1757 1389 650 317 -334 -2032 -2684 -2589 -2207 -1088
583076 -1088 147 1383 2536 2157 1008 393 270 733 1538 1414 607 457 615 339 -316 -784 -1019 -775
583625 -775 -598 87 1052 1122 300 1775 3369 3641 3584 2934 2084 1576 1825 2202 1540 137 357 1994 3304
584205 3304 3573 3062 2018 1319 1182 1082 1216 1610 1963 1959 1799 2091 3983 6259 7261 6880 6872 7555 6880
584785 6880 5147 3757 3622 3225 2510 1838 917 -435 -1049 -1822 -2968 -3648 -3339 -2546 -1794 -1460 -1918 -1903
585334 -1903 -820 157 341 -969 -2915 -4172 -3837 -3031 -2106 -1268 -795 -544 -858 -1053 452 2281 1177
585853 1177 -580 -326 317 -13 -152 -783 -1589 -1955 -743 -310 -696 -508 -393 40 852 1002 41 -1240
586403a240j530p22J317J784J261L50K56Q16m0o64O02J351J82j008j285l00k04
586921I26N67J147L83LK49M41J31K86p99j857j131r6L54M7l85p65r51l26N51J190
587532c5J528R14K86L74M02j94n89j284j116M06J460J178K14k42q80j842j392
588050h12p24m0N73J71n79K67Q21J187M07l7P82j38j130j153p99r23k11pq9J191
588661a243J219K01o14j523j082l42M25J001Q81N24k51L5l02j146o24J146J847
589180A52J161k48k62M81N69l81q32J4K022K836K490J012n91k326k415k349j333
589699@j66J004J925J290l84j191j104r71j384j450j137j069r48o50p92L72K976
590218c679K920J524l46j03P80M68k01K41J420J52n33j30k63j007p30m27o95j391
$$ plain form
586403 -1240 -2770 -3492 -2175 -391 870 1220 1476 2292 2252 1588 2190 3541 3723 2715 1430 1130 926
586921 926 1493 2640 3023 3026 3275 3716 3847 4133 3334 1477 346 250 604 651 266 -499 -1450 -1776 -1225 -35
587532 -35 1493 2407 2693 3067 3469 3275 2686 1402 286 692 2152 3330 3544 3302 2422 580 -812
588050 -812 -1536 -1576 -1003 -832 -1411 -1144 -323 864 1271 1234 2016 1878 748 -405 -1204 -2127 -2338 -2345 -2434 -1243
588661 -1243 -24 177 -437 -1960 -3042 -3384 -2959 -1958 -1077 -553 -804 -769 -1071 -2217 -2841 -1695 152
589180 152 1313 1065 803 1284 1853 1472 640 654 2676 5512 8002 9014 8423 6097 3682 1333 0
589699 0 -166 838 2763 4053 3669 2478 1374 403 -981 -2431 -3568 -4637 -5585 -6235 -7027 -6655 -3679
590218 -3679 -759 765 419 316 1096 1564 1363 1604 3024 3176 2643 2513 2250 1243 513 86 -609 -2000
590767b000j243L93O34O53N45K88L84L91L28O24R61K91l56k0M58Q16N75N44l87
591347C879m69o08k232j670J90l88N75J380R30J487J163L18l37q49j614j569p40
591865e54J604K272K65r36m47o59n89j9n46n17o0MJ24P43m60j427l28R82P49k81
592476h0j262j306j300J06J085K26m60j50N52O39J2o11J26o6j19L13O39P24J146
593055B14P02n73j58KL0q65j62J48K53o77j067J05J274J536J100J212K005Q64
593605E943p83j428j296q36J59J054K37j104n02N98N16m69j38P95O99K29l03o81
594154B690Q4N19p2j74m17P9L01%M81Q11j55j227j941j012P4J44J34l02L13O31
594765I61o05k45J00Q34N88j78l97j061r97k77J28l33O3K38o71O4J267Q00J69
$$ plain form
590767 -2000 -3243 -2850 -2216 -1563 -1018 -730 -346 45 373 997 1958 2249 1893 1873 2331 3147 3722 4266 3879
591347 3879 3410 2802 570 -1100 -910 -1298 -723 657 1587 3074 4237 4555 4218 3369 1755 186 -554
591865 -554 1050 3322 3587 2651 2204 1545 956 937 391 -126 -186 -182 -58 685 225 -1202 -1530 -548 201 -80
592476 -80 -1342 -2648 -3948 -3842 -2757 -2531 -2991 -3141 -2589 -1950 -1938 -2549 -2423 -2489 -2608 -2295 -1656 -932 214
593055 214 916 343 185 187 217 -648 -810 -662 -409 -1086 -2153 -2048 -774 762 1862 3074 5079 5943
593605 5943 5160 3732 2436 1600 1759 2813 3050 1946 1444 2042 2558 2089 1951 2746 3445 3674 3371 2690
594154 2690 2774 3293 3221 3047 2630 2709 3010 3010 3491 4302 4147 2920 979 -33 41 185 319 17 330 961
594765 961 356 111 211 1045 1633 1455 1058 -3 -1000 -1277 -1149 -1482 -1419 -1181 -1852 -1788 -521 279 448
595345D48p60j143q99m43l21j27J213J936R29L87J66J82P85P38M67J74K0J17j256
595924B613k278k622j729J29J479J296J9j084j599j241N53J094k19n22m64p61
596413e336L41O93m18m88k90m68M46J087J061J229O93Q41J98p16m74j96M55R5
596962a247p10m32Q16J789J941R30j753k221m99l93j268J10P77R97L75J18L95
597481b75M95M64k23p2r03j770o23J894K353J200Q96K7p39j583j347J205K140
597999C139N77q34j424j496r58Q76P46j009k345j864n11q5Q38J319O58k01K41
598518b333J134K355K197J196J212J284j86j713j941o89L30m5r14j504j415J58
599007h74J191P98o87r86k67K8q4p69o91q3K19J243Q27n8J71j172j786j102q92
$$ plain form
595345 448 -312 -1455 -2354 -2797 -3118 -3245 -2032 -96 833 1220 1386 1568 2353 3091 3558 3732 3752 3869 2613
595924 2613 335 -2287 -4016 -3887 -2408 -1112 -1093 -2177 -3776 -5017 -4464 -3370 -3589 -4111 -4575 -5336
596413 -5336 -4995 -4302 -4720 -5208 -5498 -5966 -5520 -4433 -3372 -2143 -1450 -609 -411 -1127 -1601 -1797 -1342 -1247
596962 -1247 -1957 -2389 -1573 216 2157 3087 1334 -887 -1386 -1779 -3047 -2937 -2160 -1163 -788 -670 -275
597481 -275 220 684 461 389 -514 -2284 -2907 -1013 1340 2540 3436 3463 2724 1141 -206 999 3139
597999 3139 3716 2882 1458 -38 -996 -120 626 -383 -2728 -4592 -5103 -5188 -4350 -3031 -2373 -2574 -2333
598518 -2333 -1199 1156 3353 4549 5761 7045 6859 5146 3205 2516 2846 2801 1887 383 -1032 -874
599007 -874 317 1115 428 -558 -825 -797 -881 -1650 -2341 -2424 -2205 -962 -135 -193 -22 -1194 -2980 -4082 -4974
599587d974J75J908K517M42o74k93j82J36p00j051M69J395R64L74R64J157N79
600105C206j042j179j100o47J63J263K319J210j94k59Q4M7m42j161o03k06j258
600624B01j097R81K167P40q54j182p31n73k12O08R03J381J340R11R54k50R9m92
601174D894j638o85J28o24o30o26r81J21j33l41R8L08J773J898J481J246M79j045
601723E723k137k058j665j331K53P57M62O56l01K18M84j222j736p46j60M35J593
602242g75J983J472n72j057j89M62j73p98j826j304M77M2o36Q6M79M41J761J235
602791A108K33n43l26o14j540q72J113J951J544Q89o29r40q35q41m55J93L58j02
603340c08j378j586L41J282M55n38N8J338R37K03N34J384J200o24p38j49r94j637
$$ plain form
599587 -4974 -4799 -2891 -374 68 -606 -899 -1081 -945 -1645 -2696 -2227 -832 132 506 1470 2627 3206
600105 3206 2164 985 -115 -762 -599 664 2983 4193 3999 3740 3824 3871 3429 2268 1665 1459 201
600624 201 -896 85 2252 2992 2138 956 225 -348 -560 48 951 2332 3672 4583 5537 5287 5386 4894
601174 4894 3256 2571 2699 2075 1445 819 -162 -41 -174 -515 -417 -109 1664 3562 5043 6289 6768 5723
601723 5723 3586 1528 -137 -1468 -1215 -458 4 660 359 577 1061 -161 -1897 -2643 -2803 -2368 -775
602242 -775 1208 2680 2108 1051 862 1324 1151 353 -1473 -2777 -2300 -2258 -2894 -2808 -2329 -1888 -127 1108
602791 1108 1341 798 472 -142 -1682 -2554 -1441 510 2054 2943 2314 1374 539 -302 -757 -564 -206 -308
603340 -308 -1686 -3272 -2931 -1649 -1194 -1732 -1674 -336 601 804 1338 2722 3922 3298 2560 2411 1417 -220
603890b20j241k37Q3P42P25l1N90J312M21m13m49o75m14j12J38o1j10R18R22M46
604500B334j273k440q01J063J160L27l51J30Q84L34j14L6o81o96k47L22L6K23
605049B46O72j90k37K80K84M58q11j513o30N95R42K67j5M45N27J1j056n40L97
605629A32%j084l10m08k87q16j380j775j184K32J564J831J113l69j99K87Q78J378
606179c97J375M95m82j058J43N84k7q59j321j025j31J081K259J342k05m61l35
606697I78M23R90J6n56J3l46q98m61j01J32j20j728k371j760j610j21J448J849
607247d223K519J880O52J01J287J072k53o34n87r64j319r56J9J317J122R51J194
607765C178J593O20j137p99o3m22o2o84n15M83p66j037J120K217M46m5l20r04
$$ plain form
603890 -220 -1461 -1698 -1615 -873 -148 -179 411 1723 2144 1731 1282 607 193 81 219 158 48 966 1888 2334
604500 2334 1061 -1379 -2180 -1117 43 370 19 149 1033 1367 1253 1289 608 -88 -335 -13 23 246
605049 246 918 728 491 771 1055 1513 702 -811 -1441 -846 96 363 348 793 1320 1331 275 -265 132
605629 132 132 -952 -1262 -1670 -1957 -2773 -4153 -5928 -7112 -6880 -5316 -3485 -2372 -2741 -2940 -2653 -1775 -397
606179 -397 978 1473 991 -67 76 660 633 -226 -1547 -2572 -2703 -1622 637 1979 1774 1313 978
606697 978 1401 2391 2407 1851 1864 1518 620 159 58 190 70 -1658 -4029 -5789 -7399 -7520 -6072 -4223
607247 -4223 -1704 176 828 929 2216 3288 3035 2401 1814 850 -469 -1425 -1406 -89 1033 1984 3178
607765 3178 4771 5391 4254 3455 3392 2970 2908 2224 1709 2192 1426 389 1509 3726 4172 4127 3807 2903
608315B903j077M5L41r65j818j97K34P94P20k16J1J70p45J92R68P90L9j035j47
608895A007R50m57M31J043j11q72p47r60j367l98K6j21L69J133N96j89n40r95
609444a202m09R93J540K78j233j871j371J125J559J52O01R26N44R83K129J236
609932E980j310j824j050n48Q05P05r89j519o3J1n72j16J218M90j224n76R6n97
610482a083j387r18n25l54Q32P52j7j78J37J006R49Q71k27j215p10R70K150R36
611031A989m87L0J046J780M41j365k559j754o60n05jk41l00J87j42M50J400J163
611580D72J663K007M98j475j720p91M58Q35o83j436l44P97j18j115l97R64J293
612099I08K54l75M9N64O72N88j45j35k81j271o20Q60K9q34r33p02O15J984J196
$$ plain form
608315 2903 1826 1871 2212 1247 -571 -768 -534 260 980 764 775 945 200 392 1360 2150 2189 1154 1007
608895 1007 1957 1500 1931 2974 2863 1991 1244 284 -1083 -1481 -1455 -1576 -1207 -74 522 333 -207 -1202
609444 -1202 -1611 -618 922 1200 -33 -1904 -3275 -2150 -591 -439 162 1088 1632 2615 4744 5980
609932 5980 4670 2846 1796 1248 2053 2758 1769 250 187 198 -374 -490 728 1218 -6 -582 -486 -1083
610482 -1083 -2470 -3388 -3913 -4267 -3435 -2683 -2700 -2878 -2741 -1735 -786 85 -142 -1357 -2067 -1097 1053 1989
611031 1989 1502 1532 2578 4358 4799 3434 875 -879 -1539 -2044 -2045 -2286 -2586 -2399 -2541 -2091 -691 472
611580 472 2135 4142 4640 3165 1445 654 1112 1947 1264 -172 -516 281 163 -952 -1349 -385 908
612099 908 1162 787 836 1400 2072 2660 2515 2380 2099 828 208 1068 1097 263 -670 -1372 -757 1227 2423
612679B423p22j620j831r79L39J649J648O34n07p27n50N79j1j418j562m82n86
613198c723j82J091J377N95J267J257Q65M35K5j49p77l99j7k75r20j77P98K38
613747A329l17n91o33o34p07P52J069o13o10k72J95J343J020j51j083k28P15M40
614297A024j10r00j145q38N29J545J51j806j311J20m47l97j22R51Q15J215J678
614815I52P33j312j612J15K46n46l71J096J065m94j16J255J047N9l78q16j60L80
615365A143m07q66m98k2q22K04J023J170J559J069L07L81M74L95N81M75l94l00
615914E472l88r71n28o98n42q75o86K75k92n42n69m0k73n43J04P11R32J267M59
616494B273l24J48p66j358p38m13r9k95j90K37J67N97N74K28J099K152J541r75
$$ plain form
612679 2423 1701 81 -1750 -2729 -2390 -741 907 1541 1034 307 -243 336 325 -1093 -2655 -3137 -3723
613198 -3723 -3905 -2814 -1437 -842 425 1682 2547 2982 3007 2858 2081 1682 1665 1390 470 293 1091 1329
613747 1329 1012 421 -212 -846 -1553 -801 268 -345 -955 -1227 -1032 311 1331 1180 97 -131 584 1024
614297 1024 914 14 -1131 -1969 -1440 105 256 -1550 -2861 -2741 -3188 -3585 -3707 -2756 -1941 -726 952
614815 952 1685 373 -1239 -1124 -878 -1424 -1795 -699 366 -128 -244 1011 2058 2117 1739 923 763 1143
615365 1143 736 -130 -628 -650 -1472 -1268 -245 925 2484 3553 3860 4241 4715 5110 5691 6166 5772 5472
615914 5472 5084 4113 3585 2887 2345 1470 784 1059 767 225 -344 -384 -657 -1200 -1096 -385 547 1814 2273
616494 2273 1949 2097 1331 -27 -765 -1178 -1277 -1572 -1762 -1525 -1358 -761 -187 41 1140 3292 4833 3858
617043C858k563j982m77R11K53p34j361q18P25J581J305J362P32q54J33N34r08
617562A697o26N67p87j613j875o57J302J395O44j96r31l30Q81K97p7L44J025j723
618111f63k716r55J166J801J290L97J65o34o55m16J99N65Q6j88k78L1l41L06J531
618691F91J010M85m63j426j440m25J98R23J977J450O0r08j102k046k121n61J363
619210b335J074o94l78j072j388o8J390J906J479J67j31N04p03q16L07J014q7
619729A69o34J550J258J84j65r2J56O42L42o6n8K73L04M42j060j914j305n70m31
620309i75Q66J656P28k63L50K50l73j9R88J102J55Q54L57q06k007j157K17M13
620858B336L14P89Q4p89j037P05J427J016N6j083k067k165p2J552Q48J27L57J25
$$ plain form
617043 3858 1295 -687 -1164 -253 0 -734 -2095 -2913 -2188 -607 698 2060 2792 1938 2071 2605 1697
617562 1697 1071 1638 851 -762 -2637 -3294 -1992 -597 47 -149 -1080 -1410 -529 -232 -309 35 1060 -663
618111 -663 -3379 -4334 -3168 -1367 -77 320 485 -149 -804 -1220 -1021 -456 -370 -558 -836 -805 -1146 -840 691
618691 691 1701 2186 1723 297 -1143 -1568 -1370 -447 1530 2980 3040 2132 1030 -1016 -3137 -3698 -2335
619210 -2335 -1261 -1955 -2333 -3405 -4793 -4861 -3471 -1565 -86 81 -50 454 -249 -1065 -758 256 169
619729 169 -465 1085 2343 2527 2362 2270 2426 3068 3410 3344 3286 3559 3863 4305 3245 1331 26 -544 -975
620309 -975 -109 1547 2275 2012 2362 2612 2239 2220 3208 4310 4465 5319 5676 4870 2863 1706 1923 2336
620858 2336 2650 3439 3523 2734 1697 2402 3829 4845 4901 3818 1751 -414 -486 1066 1914 2041 2398 2523
621407B523k99q21k61Q87k61r12p23j027p15R17Q23m1r1o87j014M67N94L63N70
621987B92R4K95K18j158r20L20J051R50q40k109j162Q3K21R01J046Q02O09R59
622536A652O04n16j840j743j999n15k22K34Q93Q91N62j03Q9J258J324J090J474
623055C133J325L87k68k39LQ61J088j237k442k051j196K70N17q71p24J084J54
623574b06m04J156R44N97m86j359j116J45O1k2L64m8m99Q51Q61M1k62M83J002
624154B103j8n32K55J22k2M22l22o56l65K64J516J357O27J29L6j89j531r01L38
624734B633J120L60j065p34r48r00J261Q14j64l79m39k17k67J53J127J603M47
625253D405j48L50J37K62M18o90m54o40j017l05L80k38j107j014O61J705j38j595
$$ plain form
621407 2523 2224 1403 1142 2029 1768 856 133 -894 -1609 -692 131 90 -1 -688 -1702 -1235 -641 -278 292
621987 292 386 681 899 -259 -1179 -859 192 1142 302 -1807 -2969 -2886 -2665 -1764 -718 84 693 1652
622536 1652 2256 1740 -100 -1843 -3842 -4357 -4579 -4345 -3452 -2561 -1999 -2102 -2013 -755 569 1659 3133
623055 3133 4458 4845 4577 4338 4341 5202 6290 5053 2611 560 -636 -366 151 -720 -1444 -360 -206
623574 -206 -610 546 1490 2087 1601 242 -874 -729 -668 -690 -326 -374 -873 -22 839 880 618 1101 2103
624154 2103 2085 1553 1808 1930 1908 2330 2008 1352 987 1251 2767 4124 4751 4880 4916 4727 3196 2295 2633
624734 2633 3753 4113 3048 2314 1366 466 1727 2541 2377 1998 1559 1342 1075 1228 2355 3958 4405
625253 4405 4257 4607 4744 5006 5424 4734 4280 3640 2623 2318 2698 2460 1353 339 1000 2705 2567 972
625802I72k214k599j465J04M19M87P83Q09l36M15J310J151N96m22q50r30M51J443
626351A24K082K086q6k020j147o25m72K12J280R15M9j213k492q16R04J391K85
626870D57N81p4r63O74O79l90p25p98l62Q02Q85J244J415N65j21o61m30k20K31
627450B789K70K84o67m37N18P38M57O2J55l75o41n70j600j505n85O59K287J410
627999C249K87o67o82j72R6J164m88k519j913j501n50L39J281J200J342J136j55
628518A447k25q3N70L42j30j73L55N28l63j648r50l67m15L36N67N05P77m6q71
629098A56j207J65Q97J269J392j44j160J00K38L46K97K17k56j065p48P76P60J118
629647C151M5q21p76L30K419Q11j556j027K71K18r86n92L60M81J11j152j763p89
$$ plain form
625802 972 -1242 -3841 -5306 -5202 -4783 -4296 -3513 -2704 -3040 -2625 -1315 -164 432 10 -840 -1770 -1319 124
626351 124 2206 4292 4206 2186 1039 414 -58 154 1434 2349 2398 1185 -1307 -2123 -1219 172 457
626870 457 1038 964 1 675 1354 964 239 -559 -921 -119 766 2010 3425 3990 3869 3208 2778 2558 2789
627450 2789 3059 3343 2676 2239 2757 3495 3952 4014 4169 3794 3153 2583 983 -522 -1107 -448 1839 3249
627999 3249 3536 2869 2187 2015 2111 3275 2787 268 -1645 -3146 -3696 -3357 -2076 -876 466 1602 1447
628518 1447 1222 1139 1709 2051 1921 1748 2103 2631 2268 620 -330 -697 -1112 -776 -209 296 1073 1027 156
629098 156 -1051 -886 11 1280 2672 2528 1368 1468 1706 2052 2349 2566 2310 1245 497 1273 2033 3151
629647 3151 3196 2375 1599 1929 4348 5159 3603 2576 2847 3065 2079 1487 1847 2328 2439 1287 -476 -1265
630197a265J02K15R1r59j888j443L51J738J722K013J298O64J010M61l22n14n29
630715B745j72n34k95J50M38K31o34n21j356j621L03J045M20q35p32N21M22q8
631265e13p21j25J5o29k60O06K70O12M7j594k024J5O47j05M33J189m96q19j53
631844c605p20q88m13R46P00Q8J014K136J341Q38l18j608q38N30L19P70J116r78
632394D30j409m76O02J380J62j775r86j75m47L95Q51P53K122K635M07r53o40o79
632943B197N83L70k61j06j351j219j142o89N93O90P36Q13R17K53K16M55l99j193
633493A463q37o44j327r89o71n20j86J6K69M38k3r38j036P9L11P8j26J113J406
634073b124J545J8j925j234N17J365J420J372R77n43j764j681r69P70J187K32
$$ plain form
630197 -1265 -1163 -948 -857 -1816 -3704 -5147 -4796 -3058 -1336 677 1975 2639 3649 4110 3788 3274 2745
630715 2745 2573 2039 1744 1894 2332 2563 1929 1408 52 -1569 -1266 -221 199 -636 -1368 -847 -425 -513
631265 -513 -1234 -1359 -1344 -1973 -2233 -1627 -1357 -745 -698 -2292 -4316 -4301 -3654 -3759 -3326 -2137 -2633 -3452 -3605
631844 -3605 -4325 -5213 -5626 -4680 -3980 -3892 -2878 -742 599 1437 1119 -489 -1327 -797 -478 292 1408 430
632394 430 -979 -1455 -853 527 689 -1086 -2072 -2247 -2694 -2299 -1448 -695 1427 4062 4469 3516 2876 2197
632943 2197 2780 3150 2889 2783 1432 213 -929 -1618 -1025 -335 401 1214 2131 2384 2600 3055 2656 1463
633493 1463 626 -18 -1345 -2334 -3005 -3525 -3711 -3695 -3426 -2988 -3011 -3949 -4985 -4906 -4595 -4517 -4643 -3530 -2124
634073 -2124 -579 -561 -2486 -3720 -3203 -1838 -418 954 1931 1388 -376 -2057 -3026 -2256 -1069 -837
634561h37M22J107J729P08k61J038J031r67k608j668l29l10j55r55q86m53o77
635080d071k29j24j066m75L11J393K469K812J444m23p50l47k07K50j6p04p2O24
635629H19L34L07l01r37m8R38l9j074k19L40N89J462K089J978n55k040j294J23
636178B472L62o87j117j421k651k326Q52K558J856J165K12m96n31o9M57L31m61
636697E06j326k534j359L92J553J753L41O34J204L09j63M86L61j13o42L3J281
637216B716R72K26O62m95j202p75j177j413k22N8r4R71Q46P08j79j128m13K49
637765C10R34l49r66M01m01l94j04r8j53m55l49R19J488J108Q72K1j425l92J033
638345B000P60J396J051K85j568j921j194j798j143Q42J105J015J048N94M54N41
$$ plain form
634561 -837 -415 692 2421 3129 2868 3906 4937 3970 1362 -306 -635 -945 -1100 -2055 -2941 -3394 -4071
635080 -4071 -4300 -4424 -5490 -5965 -5654 -4261 -1792 1020 2464 2041 1291 944 737 987 971 267 195 819
635629 819 1153 1460 1159 222 174 1112 1073 -1 -220 120 709 2171 4260 6238 5683 3643 2349 2472
636178 2472 2834 2147 1030 -391 -3042 -5368 -4516 -1958 -102 1063 1275 779 248 179 636 967 506
636697 506 -820 -3354 -4713 -4321 -2768 -1015 -674 -40 1164 1473 1310 1796 2157 2044 1402 1435 2716
637216 2716 3688 3914 4576 4081 2879 2104 927 -486 -708 -650 -744 227 1073 1781 1602 474 61 310
637765 310 1244 895 -71 330 -71 -465 -569 -667 -820 -1275 -1624 -705 783 1891 2763 2784 1359 967 2000
638345 2000 2760 4156 5207 5492 3924 2003 809 -989 -2132 -1290 -185 830 1878 2472 2926 3467
638833C467n43j417j483m22P28Q64J778K610N73j565k159j990q98l37n40j01L20
639352a115l78j340j272m41O64Q57J319J492n72r03O32J781J109P4r73q31Q08
639871I11Q30K95k57m22o42j137r20K4Q4R55P15m81o39m45J461O07j017q83L2
640451i29L00J2r13j249o9K89j375j257o08P74J342R74J380J270J352m0j048l88
641000a83j6k74QN86m17j034J1J441j2o32J38J356J994J140l85o08n61j99O41
641580B994M93k97m83j45K13n14J38J206J2q90p68p93r42q80j143r02L80J433
642129h88J213j80j413p15J367K308J851R0j235j956j359L37R79J529P49l21M27
642648B783k77n49l55j316n61O70M93J202J167j44j844j671j139o38p29m78P63
$$ plain form
638833 3467 2924 1507 24 -398 330 1194 2972 5582 6155 4590 2431 441 -457 -794 -1334 -1435 -1115
639352 -1115 -1493 -2833 -4105 -4546 -3882 -3025 -1706 -214 -786 -1689 -1057 724 1833 1907 934 103 911
639871 911 1741 2036 1779 1357 715 -422 -1342 -1318 -1234 -279 436 -45 -684 -1129 332 939 -78 -961 -929
640451 -929 -629 -617 -1530 -2779 -2848 -2559 -3934 -5191 -5799 -5025 -3683 -2709 -1329 -59 1293 1253 205 -183
641000 -183 -199 -473 -465 121 -296 -1330 -1319 122 110 -522 -384 972 2966 4106 3721 3113 2552 2353 2994
641580 2994 3487 3190 2707 2562 2775 2261 2399 3605 3617 2727 1959 1166 224 -656 -1799 -2701 -2321 -888
642129 -888 325 145 -1268 -1983 -616 1692 3543 3633 2398 442 -917 -580 399 1928 2677 2356 2783
642648 2783 2506 1957 1602 286 -275 395 888 2090 3257 3113 1269 -402 -1541 -2179 -2908 -3386 -2623
643167b623R01J0n05O00J607J168J075J157q4p95l42m37j465j407m31j81Q2P96
643716h74J025q3j101j376j300n88o18K89J187O18N6N19J885J644r04j645j049
644235b315P94J913P91P13J30l0n98q71n31q98m56l18o46J057J402k47r19J95
644784h34O17n05p31j5O25L50p23j840j554l62J078J806J331M66J246J598O7o16
645334B004p53j358j302l26Q39J227J099O86Q57M79N63j341k378r50J115N22q28
645853A55j007l72n94J1m15j671j388J73Q73M81m37L30J338O97n39p40j323q66
646402e294O53J951J439P80N61K77L66O10j39p81q40m87l03M43N27M80L80q64
646951b41j253k97L44M40J209K99j260o46p80n01J61J73J43Q2J112J201n67k349
$$ plain form
643167 -2623 -1722 -1712 -2217 -1617 -10 1158 2233 3390 3306 2511 2169 1732 267 -1140 -1571 -1752 -1670 -874
643716 -874 151 68 -1033 -2409 -3709 -4297 -4915 -4626 -3439 -2821 -2765 -2246 -361 1283 379 -1266 -2315
644235 -2315 -1521 392 1183 1896 2026 1996 1398 527 -4 -902 -1358 -1676 -2322 -1265 137 -110 -1029 -834
644784 -834 -217 -722 -1453 -1468 -843 -493 -1216 -3056 -4610 -4972 -3894 -2088 -757 -291 955 2553 2620 2004
645334 2004 1251 -107 -1409 -1735 -896 331 1430 2116 2973 3452 4015 2674 296 -654 461 983 155
645853 155 -852 -1224 -1818 -1807 -2222 -3893 -5281 -5108 -4235 -3754 -4191 -3861 -2523 -1826 -2365 -3105 -4428 -5294
646402 -5294 -4641 -2690 -1251 -471 90 367 733 1343 1204 423 -417 -904 -1207 -764 -237 243 623 -241
646951 -241 -1494 -1791 -1447 -1007 202 501 -759 -1405 -2185 -2686 -2525 -2352 -2209 -2127 -1015 186 -381 -2730
647500b730o55J671J113k15L73Q53p09j308n99L75j04j80R33L89ro5m52L92K55
648081f72o02q00R9R99O34M09K43q01m50K26m71j383k76Q06J4n73o1J350J574
648660B65m80j110J98R89N94J183Q13j50k29R86Lm30P23P44J092L73q26j024j059
649240B655j433n32L85J59m81l87R04J499m61j478J57J560J046J97l31Q15L08
649759D582k49N28n16j381n69n53O6Q97K95q07j459j051Q4j84j283j147k83o36
650308c666j107k75Q86J750J313M07O27J224J324N26r09o14J066P17n8J74n56
650827B829k137j436l52r67j548j590k67R80R0J5N46Q04J436K046J169n61j673
651346f16j572m68o01N6N35r1m86o50J13L42O88L91K40o8q3K88q3l97P39J521
$$ plain form
647500 -2730 -3385 -1714 -601 -816 -443 410 -299 -1607 -2206 -1831 -1935 -2115 -1182 -793 -802 -867 -1319 -927 -672
648081 -672 -1274 -2074 -1975 -976 -342 67 310 -491 -941 -715 -1186 -2569 -2845 -2039 -2025 -2598 -2659 -1309 265
648660 265 -215 -1325 -1127 -138 456 1639 2452 2302 2073 3059 3062 2632 3355 4099 5191 5564 4738 3714 2655
649240 2655 1222 690 1075 1234 753 366 1270 2769 2308 830 987 2547 3593 3790 3459 4274 4582
649759 4582 4333 4861 4345 2964 2395 1842 1908 2805 3100 2293 834 -217 -133 -317 -1600 -2747 -3030 -3666
650308 -3666 -4773 -5048 -4162 -2412 -1099 -692 -65 1159 2483 3009 2100 1486 2552 3269 3211 3385 2829
650827 2829 692 -744 -1096 -2063 -3611 -5201 -5468 -4488 -4398 -4383 -3837 -3033 -1597 449 1618 1057 -616
651346 -616 -2188 -2656 -3257 -3201 -2666 -2757 -3243 -3893 -3780 -3438 -2750 -2359 -2119 -2187 -2270 -1982 -2065 -2462 -1723 -202
651956b02P59m73l20L30k33q58j71R33j50O11J819P04p60m84j32k29J30p22j657
652536a105r80N04J036L71j088j404p59O01O78O29O67L42m6L24M29J14L61O95
653086A369k62j098j830j086o06q82j177L32J790K042J879Q63l28j083r77j803
653574b857j737o95M70N7M14J427O11J88K30Q59J18r86j134k53J025N75P98O27
654123b63r40j394k22J470J7j049lQ45K93m90j052j579j548n79J422J876J496
654642a700J103n96j772l82J310P26O24Q80J640L6k255k065j118k41J465K133
655130b12J198m19R5L30n69l55k61m79r6J009n29j770j066J06R04J085J273J344
655679A588P76k64m81q21j208M4J077N48j645p98J016J059L16O77J001L49M98
$$ plain form
651956 -202 557 84 -236 94 -139 -997 -1168 -235 -385 226 2045 2749 1989 1505 1373 1144 1274 552 -1105
652536 -1105 -2085 -1581 -545 -174 -1262 -2666 -3425 -2824 -2146 -1517 -850 -508 -554 -230 199 313 674 1369
653086 1369 1107 9 -1821 -2907 -3513 -4395 -5572 -5240 -3450 -1408 471 1334 1006 -77 -1054 -2857
653574 -2857 -4594 -5289 -4819 -4762 -4348 -2921 -2310 -2122 -1892 -1033 -915 -1901 -3035 -3288 -2263 -1688 -890 -263
654123 -263 -1203 -2597 -2819 -1349 -1332 -2381 -2384 -1539 -1246 -1736 -2788 -4367 -5915 -6494 -5072 -3196 -1700
654642 -1700 -597 -1193 -2965 -3347 -2037 -1311 -687 193 1833 1869 -386 -2451 -3569 -3810 -2345 -212
655130 -212 986 567 662 992 423 68 -193 -672 -768 241 -288 -2058 -3124 -3018 -2114 -1029 244 1588
655679 1588 2364 2100 1619 798 -410 -366 711 1259 -386 -1184 -168 891 1207 1884 2885 3234 3732
656198C732R63k77j838p93K89k74q91r01o6Q36L30j38n99n42l24K35Q73J764K259
656778D638Q60r19j934k988j748J72M67M71K77l08K08J407L71N50J190M11K37
657297C362o92j717j359J36N93P0N05P0p67l07n93p38M12J22O37R23J385N30o86
657877A886j751j365K29J029J349J190j86j494j551j590p09O46k41j46J763K117
658365A176M92LK09N29M7n61r70J96O69M67J90l97K04P40n27j316p24k31l18K6
658976i6n87j160n23l33O84J332J170L11j94K18J93q06j473r06k58n00o25L0j01
659555c624n77m8O33J3J71K20M36J390J004R14J138p6j036m85l13j069r26m11
660105b646M08l96j431K74J925J163p01o19N11N87M39J173N14l08m49m35q2J034
$$ plain form
656198 3732 4695 4418 2580 1787 2076 1802 911 10 -56 780 1110 972 373 -169 -493 -258 615 2379 4638
656778 4638 5498 4579 2645 -343 -2091 -1919 -1452 -981 -704 -1012 -804 603 974 1524 2714 3125 3362
657297 3362 2670 953 -406 -270 323 393 898 968 201 -106 -699 -1437 -1025 -903 -266 657 2042 2572 1886
657877 1886 135 -1230 -1001 28 1377 2567 2381 887 -664 -2254 -2963 -2317 -2558 -2704 -941 1176
658365 1176 1668 1671 1880 2409 2456 1895 925 1121 1790 2257 2447 2050 2254 2994 2467 1151 427 196 -122 -96
658976 -96 -683 -1843 -2366 -2699 -2015 -683 487 798 604 822 1015 209 -1264 -2170 -2428 -2928 -3553 -3523 -3624
659555 -3624 -4201 -4249 -3616 -3603 -3432 -3212 -2776 -1386 -382 532 1670 1594 558 73 -240 -1309 -2235 -2646
660105 -2646 -2238 -2634 -4065 -3791 -1866 -703 -1404 -2023 -1512 -925 -486 687 1201 893 444 9 -73 961
660654I61J948J255N64J38l96p47j885k250j714j048q01n7j00O51J685K200J514
661173A918M97K86L69o4P1R4o13p82q77q49j37J449O54j36j014j95J148R76P07
661753C502n26j065j65k47r0N2m35p63j89O7Jm48J157R69m52p92j788o94J364
662333e42J593n74o88P05J152L53j115l54J037K660K054l52j457j185j657k009
662821c79p26R40Q44p86j749o43j17k53j66R46J602L18j43Jm31p88K04P41O08
663401B3J39k94q38j273j974j222P98J476J238R52j06j63m9Q45o5l76J78N12N57
663981C58O8j126j407r05J71J059Q52p21j121o27q90Q68J813M42On9n61j53J040
664560h93P01Q35J79j631l05J004L30n85j072j341J69J120J378J416M20n52k52
$$ plain form
660654 961 2909 4164 4728 4866 4470 3723 1838 -412 -2126 -3174 -3975 -4032 -4132 -3481 -1796 404 1918
661173 1918 2415 2701 3070 3006 3077 3171 2558 1776 899 50 -87 1362 2016 1880 866 671 1819 2795 3502
661753 3502 2976 1911 1746 1499 1409 1461 1026 263 74 141 142 -306 851 1820 1368 576 -1212 -1906 -542
662333 -542 1051 477 -211 494 1646 1999 884 530 1567 4227 6281 5929 4472 3287 1630 -379
662821 -379 -1105 -165 679 -107 -1856 -2499 -2616 -2869 -3035 -2089 -487 -169 -312 -311 -742 -1530 -1326 -585 23
663401 23 162 -132 -970 -2243 -4217 -5439 -4641 -3165 -1927 -975 -1081 -1244 -1293 -448 -513 -889 -711 -199 358
663981 358 426 -700 -2107 -3012 -2841 -1782 -930 -1651 -2772 -3399 -4289 -3421 -1608 -1166 -1160 -1219 -1780 -1933 -893
664560 -893 -192 643 822 -809 -1114 -110 220 -365 -1437 -2778 -2609 -1489 -111 1305 1725 1173 921
665079I21k09k053j611K56N36L27O74K02q48j095J073P07k77l5Q8K67R65J057
665628I45J07p76n14j61Q34Q67R95P46l29j363j359L62P70o35j466j227l84J67
666178b421J16N60J598J975R75L6M15K07j195j199o13m57l8O33N77J63J75l79
666727A128j066n99o77p59p57L75J228Q24k73j101J07l72q07L76l88q01K6J229
667277b307J461J470Q88k65o95P5l70j918j924j03O22m72r10o42J05J559J024
667795b402l1P50O68k95j10R6P99N06L9J99m26n29l3N00M39n15k92P90oj100j238
668436b191q20J52N41R03J706J198m2J54R60M08L92J92p96q87L8o59q63J262R04
669016B552M3k38k56m0M1J098J97j622j830j301o51j79ON45j61q02j11L85N62
$$ plain form
665079 921 712 -1341 -2952 -2696 -2160 -1833 -1159 -957 -1805 -2900 -1827 -1120 -1397 -1432 -1344 -1077 -112 945
665628 945 1052 276 -238 -399 435 1302 2297 3043 2714 1351 -8 354 1124 489 -977 -2204 -2588 -2421
666178 -2421 -2305 -1745 -147 1828 2803 2839 3254 3461 2266 1067 454 -3 -41 592 1169 1332 1507 1128
666727 1128 62 -537 -1214 -1973 -2730 -2355 -1127 -303 -576 -1677 -1570 -1942 -2749 -2373 -2761 -3562 -3536 -2307
667277 -2307 -846 624 1512 1247 552 627 257 -1661 -3585 -3688 -3066 -3538 -4448 -5090 -4985 -3426 -2402
667795 -2402 -2433 -1683 -1015 -1310 -1420 -1324 -525 -19 20 219 -207 -736 -769 -269 170 -345 -637 153 147 -953 -2191
668436 -2191 -3011 -2859 -2318 -1415 291 1489 1447 1601 2561 2969 3361 3553 2757 1870 1908 1249 386 1648 2552
669016 2552 2595 2357 2101 2061 2102 3200 3397 1775 -55 -1356 -2007 -2186 -2180 -1635 -1796 -2598 -2709 -2324 -1762
669596a762K37j388j798l10j77k31N92J081J469L65m18J226R42O46O52J77Q60
670115B163m35j641Q2J622P74p09k53R62J268J80n19n10n83o72J76l58k035j371
670664a859O19R19Q4l42j267j118r1R97J917K281J105j099j715q99l14l50k16
671183a348nJ91K37K54P33J104J135k40l97n04j156p32j3K82j96O3O47P35P98
671763A588N40l53l13q5l88P1r9L11j17n36J030J277O17o61j902k001j194k7n1
672343b293j036o79k39p19q37j73Q24J299O38J53J556J575m02m18Q6R92J016n66
672892G77p27k15n24l30J32J91K20J53l5J053J106L24m63O35J568R76Q30l40k735
673472B596k659j007j512q97Q51J329P58Q18Q29l75j216j096L63J361J027l59
$$ plain form
669596 -1762 -1525 -2913 -4711 -5021 -5198 -5429 -4837 -3756 -2287 -1922 -2340 -1114 -172 474 1126 1303 2163
670115 2163 1728 87 169 1791 2565 1856 1603 2565 3833 4013 3494 2984 2401 1729 1905 1547 -488 -1859
670664 -1859 -1240 -321 -237 -579 -1846 -2964 -3055 -2058 -141 2140 3245 2146 431 -468 -782 -1132 -1348
671183 -1348 -1353 -1162 -925 -671 62 1166 2301 2061 1664 1160 4 -728 -741 -459 -655 -592 55 790 1588
671763 1588 2128 1775 1462 1377 989 1060 961 1272 1155 619 1649 2926 3543 2882 980 -1021 -2215 -2242 -2293
672343 -2293 -3329 -4008 -4247 -4966 -5803 -5976 -5152 -3853 -3215 -3062 -1506 69 -333 -751 -665 327 1343 777
672892 777 50 -165 -689 -1019 -887 -696 -476 -323 -358 695 1801 2125 1662 2297 3865 4841 5671 5331 2596
673472 2596 -63 -1070 -2582 -3479 -2628 -1299 -541 277 1106 731 -485 -1581 -1218 143 1170 811
673960H11j261o19J028Q33J90J48L49J158O67K1o6q54j682N17J430O84R3j008
674509B439j342r24q51j107K01N24P29R03J60M97J90j221J12Q90j94o56k03M64
675059F11j86n29j66J333O68j169p21j41n46j029n47r2r61r92m22K11K696L143
675608A161J033o45q89R3n10o13J5q36o50K88P55N41l17l81L03J811J733J310
676157D202J396J530Q84j436k694j658m75l06n03j499j043R44P29m07Rk21j16
676676f64q27p46Q36M59o93n28M88O74P59J363J779O00o33j106q96o20k28jN0
677256F6l53l86m19j36J190J807O83p69j097q92n08R17P00j358j735p94l57J110
677806b331K145P50n62r13o1O67O68M57l48k071k85J253R61J085R94L29L58P08
$$ plain form
673960 811 -450 -1069 -41 792 982 1130 1479 2637 3304 3325 3259 2405 723 1240 2670 3354 3447 2439
674509 2439 1097 173 -678 -1785 -1584 -1060 -331 572 732 1229 1419 198 310 1200 1006 350 147 611
675059 611 425 -104 -270 1063 1731 562 -159 -300 -846 -1875 -2422 -2514 -3475 -4467 -4889 -4678 -1982 1161
675608 1161 2194 1549 660 753 243 -370 -355 -1191 -1841 -1553 -798 -257 -574 -955 -652 1159 2892 4202
676157 4202 5598 7128 8012 6576 3882 2224 1749 1443 940 -559 -1602 -658 71 -336 -327 -548 -664
676676 -664 -1491 -2237 -1401 -942 -1635 -2163 -1675 -1001 -242 1121 2900 3500 2867 1761 865 245 17 16 66
677256 66 -287 -673 -1092 -1228 -38 1769 2452 1683 586 -306 -814 103 803 -555 -2290 -3084 -3441 -2331
677806 -2331 -186 564 2 -911 -972 -305 363 820 472 -1599 -1884 -631 330 1415 2409 2738 3096 3804
678355C804j07o45J66n0j13J02L05M49q3J18j78q15j097j505l21L59L80J096l78
678935A487k057j834J83J832j00j078M70J386L54q84j127m64K69N94L4M26P31
679453B22R88K2l20k39j126n52P91J220J505K56j766j733L14J030Q66M45O89O74
680003C286R65K69q01n72m56l32O63J696m92j338j243j189j68R7o27l92R04K3
680552B93qr55k146m69N60K95J78k23r9Q4J65O68L97j066j373r23L01J345J277
681132a699O20K31J094J264L39m80L44O03O11k14l36o67k003j799l14L22L58O13
681681a113R73Q69m10j726k122j084N1J099P90j77O79J102J632J254J38j317j334
682200f96o24K82J343M08m11N12L7j937j164J194J493J255Q66J14r58p45L56N7
$$ plain form
678355 3804 3697 3052 3218 3168 3055 3157 3462 3911 3828 3946 3768 2953 1856 351 30 389 769 1865 1487
678935 1487 -570 -2404 -2221 -389 -489 -1567 -1097 289 643 -241 -1368 -1832 -1563 -969 -935 -509 222
679453 222 1210 1232 912 673 -453 -1005 -214 1006 2511 2767 1001 -732 -418 612 1478 1923 2612 3286
680003 3286 4251 4520 3719 3147 2691 2359 3022 4718 4226 2888 1645 456 288 385 -242 -634 270 293
680552 293 285 -670 -2816 -3285 -2725 -2430 -2252 -2475 -2574 -2490 -2325 -1657 -1260 -2326 -3699 -4622 -4321 -2976 -1699
681132 -1699 -1079 -848 246 1510 1849 1369 1713 2316 2927 2713 2377 1710 -293 -2092 -2406 -2084 -1726 -1113
681681 -1113 -140 729 319 -1407 -3529 -4613 -4562 -3463 -2673 -2850 -2171 -1069 563 1817 1955 638 -696
682200 -696 -1320 -1038 305 713 302 814 851 -1086 -2250 -1056 437 1692 2558 2672 1714 969 1325 1382
682750A382L81l69j612j262k33j86O34J033N51J80O46R32j48j868j615l11o95
683268b560j11P33O79J76M22R10j26j600r60O87J088J050P98N3j173q62o49Q41
683818f04J830K77j249n07M88k6r75j474o95l09m79n60l42J199K610K304J119
684336B607k95o93L30L10j148j457j539j115M61K294K186O96n50j835j692o85
684825b125m04l35m44l00MO8N33m31j329r47M20P49o7L86J296J314M96j94O92
685404f18Q59P92K36K49p0r45p65L6O06k05j410n79O57J222K51l97l74n80k43
685984a278M17M77K37L27N93k9j617j603J51Q77J95L72L58p98j008j001j015j023
686534e368K42P55j7l47M16J744Q94J036P57M0l3p45m66K75M50L88Q00J501K056
$$ plain form
682750 1382 1763 1394 -218 -1480 -1713 -1899 -1265 -232 319 499 1145 2077 1929 61 -1554 -1865 -2560
683268 -2560 -2671 -1938 -1259 -1083 -661 249 123 -1477 -2437 -1750 -662 388 1186 1239 66 -796 -1445 -604
683818 -604 1226 1503 254 -253 235 209 -766 -2240 -2935 -3244 -3723 -4283 -4625 -3426 -816 1488 2607
684336 2607 2312 1619 1949 2259 1111 -346 -1885 -3000 -2539 -245 1941 2637 2087 252 -1440 -2125
684825 -2125 -2529 -2864 -3308 -3608 -3604 -3536 -3003 -3434 -4763 -5710 -5290 -4541 -4608 -4222 -2926 -1612 -1116 -1310 -618
685404 -618 241 1033 1269 1518 1448 503 -262 -226 380 175 -1235 -1814 -1157 65 316 -81 -455 -1035 -1278
685984 -1278 -861 -384 -147 180 773 744 -873 -2476 -2325 -1448 -1253 -881 -523 -1321 -2329 -3330 -4345 -5368
686534 -5368 -5126 -4371 -4388 -4735 -4319 -2575 -1681 -645 112 152 119 -626 -1092 -817 -367 21 821 2322 4378
687114D378K620J200j257k301j989n47K32J072j73j085m89m48k22L8L27J19O05
687633B080J514J748L07j971k248l77Q63o33j591k17j2L69M98l24l26j86K62L21
688182G7O34l27k05K36j06n58l16O74J431J74m39l20j034l25J059L40J64K58j38
688762A279K90K50M0q90j330q41q16q47l69R04L11j72J099O53l98k98K60N45j75
689341e05L77N28R06J655J819P17j61m93n94q62q62l63R1M84n6j033j625j638
689891a615K93R74J69K81Q86J074Q85Q97K08j191j971j201m7M21N34M50J093M73
690440B613j090j400j523l69R14J239R14r0j224j197q20J14K96n46m38J05K02
690959b300J70J695J631K0m83l46R3j27l35r40j038K45J078K68m50M55J093M80
$$ plain form
687114 4378 6998 8198 6941 4640 2651 2104 2336 3408 3235 2150 1661 1213 991 1029 1356 1475 2080
687633 2080 3594 5342 5649 3678 1430 1053 1916 1283 -308 -525 -537 -168 330 6 -320 -506 -244 77
688182 77 711 384 179 415 309 -249 -565 109 1540 1714 1275 955 -79 -404 655 995 1159 1417 1279
688762 1279 1569 1819 1859 969 -361 -1202 -2018 -2865 -3234 -2330 -2019 -2191 -1092 -439 -837 -1135 -875 -330 -505
689341 -505 -128 400 1306 2961 4780 5497 5336 4843 4249 3387 2525 2162 2253 2737 2681 1648 23 -1615
689891 -1615 -1322 -348 -179 102 988 2062 2947 3844 4052 2861 890 -311 -358 63 597 1047 2140 2613
690440 2613 1523 123 -1400 -1769 -855 384 1298 1208 -16 -1213 -2033 -1919 -1623 -2169 -2607 -2502 -2300
690959 -2300 -2130 -435 1196 1216 733 387 480 353 18 -922 -1960 -1715 -637 -369 -819 -364 729 1209
691508A209n72q58j492k13J385O39K07K24J163J166o8j419j585j301o66j066o69
692027c916M90K145J404m2q44k16L17P82J625J037L92q88j023m07m31M08J128
692546A961M16Q71p57j824j318p79r6N66P73k01l26J58n93l57J70J60P04L67J55
693126E0j25j63O0j96n42k65N61K0p52L06J638J477N73o44j103m9M33n39p33M58
693736D65L60L6R54K02m44r33j155o3N92R68J05l0j081j107p67p55k67P52J302
694316h66Q94Q24Q19O44K62J28r1m48m00r36j803K22J750N22q86j322p32m98N23
694896a394P34Q90J21j618n96K77K019K133J83O6p5j008j705j254j46R14J794
695414A335K045J605o57k112j493K38J497P35l80j348n37O75l26r15J46j62R8
$$ plain form
691508 1209 637 -221 -1713 -1926 -541 98 305 529 1692 2858 2790 1371 -214 -1515 -2181 -3247 -3916
692027 -3916 -3426 -1281 123 81 -763 -979 -662 120 1745 2782 3174 2286 1263 856 425 833 1961
692546 1961 2377 3248 2491 667 -651 -1430 -1526 -960 -187 -388 -714 -556 -1149 -1506 -1336 -1176 -472 -105 50
693126 50 -75 -238 -178 -374 -916 -1181 -620 -600 -1352 -1046 592 2069 2642 1998 895 846 1279 740 7 465
693736 465 825 861 1815 2017 1573 640 -515 -578 14 982 1087 1057 -24 -1131 -1898 -2653 -2920 -2168 -866
694316 -866 28 852 1671 2315 2577 2705 2614 2166 1766 830 -973 -751 999 1521 635 -687 -1419 -1917 -1394
694896 -1394 -660 230 351 -1267 -1863 -1586 433 2566 2749 2815 2740 1732 27 -1227 -1373 -459 1335
695414 1335 3380 4985 4328 2216 723 961 2458 3193 2813 1465 928 1603 1277 362 508 346 444
695933D44j22Q58J855Q67k89q31o68n70n97K0L88j64p08m01m10N54P68p82p75
696513e63n1J47L02R77j04q83j273o0R74J485R18m39J13J028j24j779j969l79
697063a680Q11O71K97L1M00P21m43k046j539r13M35N81n84q51k33m48j96J289
697612c697J422K79K71K379K650J466k77m64r51j500j348n56O35Q63k25j829j208
698131b090L80J127N23K01j65k10j04n51k77o94j870j729o86j45J73J954K318
698650a845J229L68M17O55j47j004j748j88J750J983O99n8r86j426l50J223K65
699168H37n57K32J550J682L98l23m68J09R74P12m00q70m15O09L13qK69O73M24
699748E741j899k813j512j92o7o23j11J4M02P12J097R74J08l26j74l37q42m34
$$ plain form
695933 444 322 1180 3035 3902 3613 2782 2114 1544 947 967 1355 1191 483 82 -328 226 994 212 -563
696513 -563 -614 -467 -165 812 708 -175 -1448 -1508 -534 951 1869 1430 1543 2571 2447 668 -1301 -1680
697063 -1680 -869 -198 99 130 530 1251 808 -1238 -2777 -3690 -3255 -2674 -3258 -4109 -4342 -4790 -4986 -3697
697612 -3697 -2275 -1996 -1725 654 3304 4770 4493 4029 3078 1578 230 -326 309 1172 947 -882 -2090
698131 -2090 -1710 -583 -60 141 -24 -234 -338 -889 -1166 -1860 -3730 -5459 -6145 -6290 -6117 -4163 -1845
698650 -1845 -616 -248 169 824 677 -327 -2075 -2263 -513 1470 2169 2111 1125 -301 -651 572 837
699168 837 280 512 2062 3744 4142 3819 3351 3460 4434 5146 4746 3876 3461 4070 4383 4375 4644 5317 5741
699748 5741 3842 1029 -483 -675 -742 -1365 -1476 -1462 -1060 -348 749 1723 1831 1505 1331 994 152 -282
700297b82K43j73o7k75l2J333J648J332l43j622j337m50L32R22N42o48j913j336
700847b126N03N37k55N58P33j98N5Q15J282Q15q48j314j318j715j152j467j370
701366f465O32N70K90J277J401J69k57J091J280K22J3K35L00R65P03qj862k904
701915b348j513L89J092J737J555O41l18l18j20n35k40J195L92j543j608K72J191
702434g9J244J144J425J249L58n97j705j905j484m79NL26j16j047j425q52j669
702953e607j742j48J689K052K272J468j040k039J69J828J582K75j729k085JP79
703441b275P41Q57n53j875q22L56J01J25J37m63n61R5J344J756J476J762J359
703960C560P6r23p07j12J007L12O3M7L39Q96P43P8n05j491j550m09o51j216j406
$$ plain form
700297 -282 -39 -212 -279 -554 -586 747 2395 3727 3384 1762 425 -25 307 1229 1771 1123 -790 -2126
700847 -2126 -1623 -1086 -1341 -783 -50 -248 -193 622 1904 2719 1871 557 -761 -2476 -3628 -5095 -6465
701366 -6465 -5833 -5263 -4973 -3696 -2295 -2126 -2383 -1292 -12 210 223 458 758 1723 2426 2418 556 -2348
701915 -2348 -3861 -3472 -2380 -643 912 1553 1235 917 797 262 22 1217 1609 66 -1542 -1270 -79
702434 -79 1165 2309 3734 4983 5341 4744 3039 1134 -350 -829 -824 -498 -614 -1661 -3086 -3938 -5607
702953 -5607 -7349 -7497 -5808 -3756 -1484 -16 -1056 -3095 -2926 -1098 484 759 -970 -3055 -3054 -2275
703441 -2275 -1534 -677 -1230 -3105 -3927 -3571 -3470 -3345 -3208 -3671 -4232 -4137 -2793 -1037 439 2201 3560
703960 3560 3636 2713 2006 1894 2901 3213 3276 3323 3662 4558 5301 5379 4874 3383 1833 1424 773 -443 -1849
704540a849j66O11O59J979J926N83q26j860j463L4N27l81J028J700J339N63O94
705058E098m58j278n53o19j431j758r46J500J221P20L91j47n04L15P25p80j488
705577Hp13L59J7j809j163J011K050J558K48k22P2l0L97o7n14o79m25M65o01r47
706188i85o37J84M27P73J144oj075l99l21M22O69J62M60L6j532j172N39J521J251
706768A461n69k414j809k07J80k99L5l12J05K95n15k54P70J221M72N02N41K14
707317e83o60j60Q58L57L74J70k89M70K198P60q69m51j56n44j021k256j926L22
707866c406K684K878J82j445j583j585l97K50J227K223J011p9J45M14l87j644
708355D88m79O55k52j152J66J600O92j64M5l66j354j525j63O12N48J143R60k60
$$ plain form
704540 -1849 -2015 -1404 -745 1234 3160 3743 2917 1057 -406 -372 155 -226 802 2502 3841 4404 5098
705058 5098 4640 3362 2809 2190 759 -999 -1945 -445 776 1496 1887 1740 1236 1551 2276 1496 8
705577 8 -705 -346 -329 -2138 -3301 -2290 -240 1318 1566 1344 1416 1386 1783 1716 1202 523 98 563 -38 -985
706188 -985 -1622 -1438 -1011 -238 906 900 -175 -574 -895 -473 196 358 818 854 -678 -1850 -1311 210 1461
706768 1461 892 -1522 -3331 -3538 -3358 -3657 -3622 -3934 -3829 -3534 -4049 -4303 -3533 -2312 -1840 -1338 -797 -583
707317 -583 -1243 -1403 -545 -188 186 356 67 537 2735 3495 2626 2175 2019 1475 454 -1802 -3728 -3406
707866 -3406 -722 2156 2338 893 -690 -2275 -2672 -2422 -1195 1028 2039 1960 2105 2519 2132 488
708355 488 9 664 412 -740 -574 1026 1718 1554 1599 1233 -121 -1646 -1809 -1197 -649 494 1454 1194
708904A194j77o47j060r1L38J202P22p87j294j816j720p07J16J876K404K028K390
709423C971K27j867j307m24l47l43k41L24p53m09R26J137N80o35j143p2J143P03
709972A470K33m31r24j120j348j75J310J275J70J73J072J149J74k47o91j281j181
710491c72j143J099J280N23K99J37o81j076m10K67M41O89J00j461j032J517J855
711009B032j26r15m56k6L37l34J49L42L62R74K039O91j115l79N34q12j767j657
711559a27j371J37J547J493L45j56O16R7j280k633k218j101p43K58Q35J194K183
712078i24J946n24p11M36P87J343J027N45j59o41p83j277j571j047o57j089k90
712597c589J90O72J614J528J508O42L58J97K40k66q79j526j302O1P70N79P8n1
$$ plain form
708904 1194 1017 370 -690 -781 -443 759 1481 694 -600 -2416 -4136 -4843 -4727 -2851 -447 1581 3971
709423 3971 4198 2331 1024 600 253 -90 -331 -7 -760 -1169 -243 894 1474 839 -304 -376 767 1470
709972 1470 1703 1272 348 -772 -2120 -2295 -985 290 460 633 1705 2854 3028 2781 2090 809 -372
710491 -372 -1515 -416 864 1387 1686 1823 1142 66 -344 -77 364 1053 1153 -308 -1340 177 2032
711009 2032 1906 991 535 509 846 512 661 1003 1365 2339 4378 5069 3954 3575 4109 3297 1530 -127
711559 -127 -1498 -1361 186 1679 2024 1868 2484 2581 1301 -1332 -3550 -4651 -5394 -5136 -4301 -3107 -924
712078 -924 1022 498 -213 223 1010 2353 3380 3925 3766 3125 2342 1065 -506 -1553 -2210 -3299 -3589
712597 -3589 -3399 -2727 -1113 415 1923 2565 2923 3120 3360 3094 2215 689 -613 -552 218 797 875 824
713146H24M59n55j671j605m20K12n23n31J255J738N86r57q22Q81J962J052J08
713665A993J87o59o60k42k47j33L71J021K33k57r27p3J087P42n4n57q04p0r3n99
714275B59l35P05L39j40j017k214k222n91J353J076l86k66j79K39l39q11J41J364
714824c024J494J323O30J8K73N96m04o41q29K59O88L29R32R90q37j573k069m84
715374b329J161P66j85j501j926J03K621K693J055K68q6J90j673j720J1M55Q51
715893G54J079J069L57m34j681k135m43N85J2j00K52J69p34q50m85L53L85r24
716442b771j465k21P02R49R92N50L69O6n10j170k120k88K170K516J447j15q21
716961B80m51p43Nj84n10k46P96J224J143L69L73P9o00j427r9J392J582K87p41
$$ plain form
713146 824 1283 728 -943 -2548 -2968 -2756 -3279 -3810 -2555 -817 -231 -1188 -2010 -1129 833 1885 1993
713665 1993 2180 1521 861 619 372 239 610 1631 1864 1607 680 607 1694 2436 2382 1825 1021 951 858 259
714275 259 -76 629 968 828 -189 -2403 -4625 -5216 -3863 -2787 -3173 -3439 -3618 -3379 -3718 -4529 -4388 -3024
714824 -3024 -1530 -207 423 441 714 1310 906 265 -564 -305 383 712 1644 2634 1797 224 -1845 -2329
715374 -2329 -1168 -402 -587 -2088 -4014 -3911 -1290 1403 2458 2726 2640 2830 1157 -563 -552 -97 754
715893 754 1833 2902 3259 2825 1144 -991 -1434 -849 -837 -937 -685 -516 -1250 -2100 -2585 -2232 -1847 -2771
716442 -2771 -4236 -4457 -3755 -2806 -1814 -1264 -895 -829 -1339 -2509 -4629 -4917 -2747 -231 1216 1101 280
716961 280 -171 -914 -909 -1093 -1603 -1849 -1053 171 1314 1683 2056 2135 1535 108 9 1401 2983 3270 2529
717541B529p32j487k127j432m38L70J053J127J026N05R25J58j227j039p66j19
718029a674N45J133Q00r66r89N84O29q47q36j213r37J061K308K637K072P57n2
718548E012o78k41j98j124j982j201L91J196P62l16l57N5j88O1O71J061K22m60
719097B686j443j432j003j187r07m06O00Q38J61l3j78l0N89P31Q89P58K50K36
719646A119j013k495k746p53N28L10n04l0N64Q77M96J394J080P41J155j52j26
720165D45M51M91K98m80r58j467l88M60J49O44J533R07k81m71j80j51o60l80k82
720745c20lJ08o51p44K76J346J367K07k2K48j338k432k171q9K515K569J206M42
721294B514o7p56j739n72O51N17p89j009n73L8J197L62k76Q75N65j573k262K64
$$ plain form
717541 2529 1797 310 -1817 -3249 -3687 -3317 -2264 -1137 -111 394 1319 1477 250 -789 -1555 -1674
718029 -1674 -1129 4 804 -162 -1151 -567 62 -785 -1621 -2834 -3771 -2710 -402 2235 4307 5064 5012
718548 5012 4334 4093 3895 2771 789 -412 -21 1175 1937 1621 1264 1319 1131 1192 1863 2924 3146 2686
719097 2686 1243 -189 -1192 -2379 -3286 -3692 -3092 -2254 -2093 -2126 -2304 -2334 -1745 -1014 -125 633 883 1119
719646 1119 106 -2389 -5135 -5888 -5360 -5050 -5554 -5584 -5020 -4143 -3647 -2253 -1173 -432 723 571 445
720165 445 896 1387 1685 1205 247 -1220 -1608 -1148 -999 -355 1178 2085 1804 1333 1153 1002 342 -38 -320
720745 -320 -323 -215 -866 -1610 -1334 12 1379 1586 1564 1812 474 -1958 -4129 -4218 -1703 866 2072 2514
721294 2514 2447 1691 -48 -620 31 548 -241 -1250 -1823 -1785 -588 -226 -502 373 938 -635 -2897 -2633
721844b633J123J345J689J067l81j158n73o75j252j566o33r63j66J405J404N04
722332a463R3O29J807J112k73r29m29j71p15k45r4R34J263j1J94m42q93Q6M69
722912I22l77n52k62j354o89M15R72J384P62M34M67J411Q52J06K6l55r58q07P8
723492B475j45j029j488j604q89P43O06L66r9m13K81K80q10m49N37O8M27L34P27
724071h2J519L42o74j722j512Q37K120J731j93k250m96J262Q21n70n43M39J462
724590B491M99j381o01M99J19n24m57l15j190k117n55J115J464J80m94M70K342
725109A545K807J548o5j456j073j319k376j532J52N40K95O5n9Q16L06r39j285
725628b030m80L20K71N8Q56J376Q03O72J099M10o86p11j053p98L5M83o52j192
$$ plain form
721844 -2633 -1510 -165 1524 2591 2210 1052 479 -196 -1448 -3014 -3647 -4610 -4776 -3371 -1967 -1463
722332 -1463 -1370 -741 1066 2178 1905 976 547 376 -339 -584 -678 256 1519 1508 1702 1260 367 453 922
722912 922 545 -7 -269 -1623 -2312 -1897 -925 459 1221 1655 2122 3533 4385 4491 4517 4162 3204 2397 2475
723492 2475 2330 1301 -187 -1791 -2680 -1937 -1331 -965 -1064 -1477 -1196 -916 -1726 -2175 -1638 -1570 -1143 -809 -82
724071 -82 1437 1779 1105 -617 -2129 -1292 828 2559 2366 116 -380 882 1703 1133 590 1029 2491
724590 2491 2990 1609 1008 1507 1626 1102 645 330 -860 -2977 -3532 -2417 -953 -773 -1267 -797 1545
725109 1545 4352 5900 5835 4379 3306 1987 -389 -1921 -1769 -1229 -934 -869 -928 -112 194 -745 -2030
725628 -2030 -2510 -2190 -1919 -1861 -1005 371 1174 1846 2945 3355 2669 1958 905 107 142 625 -27 -1219
726177a219o54r94j060l80Q96J702J032O94J9j110j047j117j787j512o9Q58J220
726696d528J260J39q45o32l79M23J857J178p98j023K33j05l40j49J30q34m25O66
727246d172Q05O90P56O46l28l81k89m40m17P08K320J543oM98J057K82L9m52j497
727825A362j628j478p73J77K86JO4o09q92J02L84N87R23l39n47M59J09M46J020
728405c46M73q76L75J179j96j418r37RO52P87J89q35j744j091j29n6Q27J530J518
728985h9R60R15J79M07J549P60k14k25q5p20j043q38P4m13j243j217j442R7K359
729565b29K231Q6l10N93L08J0k88j349j576j700l90P76K24m18k56o0P30J171j37
730145e84j328O96K223J292K83k89q96j758j368j123j092Q32K622J359o17j387
$$ plain form
726177 -1219 -1873 -2867 -3927 -4307 -3411 -1709 -677 17 36 -1074 -2121 -3238 -5025 -6537 -6606 -5748 -4528
726696 -4528 -3268 -3129 -3974 -4606 -4985 -4562 -2705 -1527 -2325 -3348 -3115 -3220 -3560 -3709 -3579 -4413 -4838 -4172
727246 -4172 -3367 -2677 -1921 -1275 -1603 -1984 -2273 -2713 -3130 -2422 -102 1441 1435 1933 2990 3272 3311 2859 1362
727825 1362 -266 -1744 -2517 -2340 -2054 -2053 -1989 -2598 -3490 -3388 -3004 -2417 -1494 -1833 -2380 -1921 -1812 -1366 -346
728405 -346 127 -749 -374 805 609 -809 -1746 -1737 -1085 -298 -109 -944 -2688 -3779 -3908 -3964 -3137 -1607 -89
728985 -89 871 1786 1965 2372 3921 4681 4467 4242 4157 3437 2394 1556 1630 1217 -26 -1243 -2685 -2588 -229
729565 -229 2002 2088 1778 2371 2679 2689 2401 1052 -524 -2224 -2614 -1838 -1614 -2032 -2288 -2348 -1618 -447 -584
730145 -584 -1912 -1216 1007 2299 2582 2293 1397 -361 -1729 -2852 -3944 -3112 -490 869 252 -1135
730633a135q26k39N5O6RO69N36o13p50M84K87p95j132o78Q17N79j94J711K673
731213A524Q80j381j813k69p14O4L58k40l24R7L21M07P07M29K51K53L26j84p20
731793b8q75o80o7J07k20n98k36J236J110J47q97p31j49m96p1J347J605k78j518
732373a292j634j113J07Q48M01j124o95J464K233K042M1j022j0J173P30O61J010
732891C820P98mp02j106n38j13n46J43k35o12K63J57n35m21L71J386M65M82P83
733471C856m54o78o67j258j082q07j271q72j33O16J57k23P14K074J775j47p58
733990H42j72L10M54J07m01o8m81p90j604k272q27k40L60J160L13l86J228J371
734539a096m19j339p09P50P62L74j79k65O5L24O2r28q19k73l92j59J628J724K90
$$ plain form
730633 -1135 -1961 -2200 -2145 -2079 -2070 -1401 -865 -1478 -2228 -1744 -1457 -2252 -3384 -4062 -3245 -2666 -2860 -1149 1524
731213 1524 2404 1023 -790 -1059 -1773 -1709 -1351 -1591 -1915 -1818 -1497 -1090 -383 46 297 550 876 692 -28
731793 -28 -903 -1583 -1650 -1543 -1763 -2361 -2597 -1361 -251 -104 -1001 -1732 -1881 -2377 -2448 -1101 504 226 -1292
732373 -1292 -2926 -4039 -3932 -3084 -2683 -3807 -4502 -3038 -805 1237 1278 256 246 1419 2149 2810 3820
732891 3820 4618 4614 3912 2806 2268 2155 1609 1752 1517 905 1168 1325 790 369 740 2126 2591 3073 3856
733471 3856 3402 2724 2057 799 -283 -1090 -2361 -3233 -3366 -2750 -2593 -2816 -2102 -28 1747 1600 842
733990 842 670 980 1434 1541 1140 1072 591 -199 -1803 -4075 -4902 -5142 -4782 -3622 -3309 -3695 -2467 -1096
734539 -1096 -1515 -2854 -3563 -2813 -2051 -1677 -1856 -2121 -2056 -1732 -1670 -2598 -3417 -3690 -4082 -4241 -2613 -889 -599
735119e99n63l99K33o16j839p58N18O58O37K29j56k80J095K115J225k36n54p23
735669a3n90N94K72l22o81m52J02k64K21J521R42r44j503r66p21K2J64P79Q70
736249i69N83J169J095M32p75k594j060N69L06l0O21M76L13J098J19j271j509
736767a427r55K32J56K64M64L37m18L44J193R41q33k154l05J272O70j46k81k3
737317f69L48Q42O24jP02M15J94j04j487j240r52n47m2O71J017J394Q69l99j255
737896C80j218l27O28m44p32l66j21QK17R72Q90j7K5Q81K88q31j152n51r17q72
738507c259Q88J774J552M76n41j057j015o32k9o02j217k56J307J173N86N60k42
$$ plain form
735119 -599 -1162 -1561 -1328 -1944 -3783 -4541 -4023 -3365 -2728 -2499 -2655 -2935 -1840 275 1500 1264 710 -13
735669 -13 -603 -9 263 -59 -740 -1192 -1090 -1354 -1133 388 1330 386 -1117 -2083 -2804 -2782 -2618 -1839 -969
736249 -969 -386 783 1878 2310 1535 -1059 -2119 -1550 -1244 -1274 -653 -177 136 1234 1353 82 -1427
736767 -1427 -2382 -2150 -1994 -1730 -1266 -929 -1347 -1003 190 1131 298 -1856 -2161 -889 -219 -365 -646 -669
737317 -669 -321 521 1145 1144 1846 2261 2455 2351 864 -376 -1328 -1875 -1917 -1246 -229 1165 2034 1635 380
737896 380 -838 -1165 -537 -981 -1713 -2079 -2200 -2192 -1975 -1003 -113 -130 -105 776 1064 233 -919 -1470 -2387 -3259
738507 -3259 -2371 -597 955 1431 890 -167 -1182 -1814 -1843 -2445 -3662 -3918 -2611 -1438 -852 -292 -534
$$ [...]
##END=
